{"text_format":"1","workbook":"xlsx","n_sheets":11,"sheets":["Hamburg Knights","Knights 2","Wesseling Vermins","Freising Grizzlies","Haar Disciples","Karlsruhe Cougars","Neunkirchen Nightmares","Team 8","Offense Leaders","Pitching","Pitching Leaders"],"not_rendered":{"charts":0,"images":0,"macros":1,"external_links":0,"defined_names":3,"comments":0,"pivot_tables":0},"unopened":[],"bounds":{"document_bytes":16777216,"sheet_cells":100000,"rows_first":2000,"rows_last":500,"rows_between":2000,"halvings":0,"cell_chars":16384,"cell_head_chars":4096},"cells_cut":0,"cells_raw":0,"read":"whole","date_system":"1900"}

{"sheet":"Hamburg Knights","index":0,"n_rows":85,"n_cols":22,"rows_kept":85,"cut":false,"hidden":false,"merged":[[0,3,0,17],[0,19,0,21]]}
[null,null,null,"Offense",null,null,null,null,null,null,null,null,null,null,null,null,null,null,null,"Defense"]
["ID","Spieler","Gegner","PA","AB","R","RBI","H","2B","3B","HR","K","BB","HP","SB","CS","SH","SF",null,"A","PO","E"]
[1,"Bertonasco","Wesseling",1,1,null,null,null,null,null,null,1,null,null,null,null,null,null,null,2,null,1]
[null,null,"Haar"]
[null,null,"Neunkirchen",2,2,null,null,null,null,null,null,2]
[]
[]
[2,"Strohm","Wesseling",1,1,null,null,null,null,null,null,1,null,null,null,null,null,null,null,null,2,2]
[null,null,"Haar",1,1,null,null,null,null,null,null,null,null,null,null,null,null,null,null,null,null,1]
[null,null,"Neunkirchen",2,2,1,1]
[]
[]
[3,"Rackwitz","Wesseling",1,1]
[null,null,"Haar",2,2,1,null,1,1,null,null,null,null,null,1,null,null,null,null,null,3,1]
[null,null,"Neunkirchen",3,1,1,null,1,1,null,null,null,2,null,1]
[]
[]
[4,"Haase","Wesseling",1,1,null,null,null,null,null,null,1,null,null,null,null,null,null,null,null,null,1]
[null,null,"Haar"]
[null,null,"Neunkirchen"]
[]
[]
[5,"Brunzel","Wesseling",1,1,null,null,null,null,null,null,1,null,null,null,null,null,null,null,1,2]
[null,null,"Haar",1,1]
[null,null,"Neunkirchen",2,1,1,null,null,null,null,null,1,null,1,1]
[]
[]
[6,"Wittkugel","Wesseling",1,1,null,null,null,null,null,null,null,null,null,null,null,null,null,null,null,1]
[null,null,"Haar"]
[null,null,"Neunkirchen",2,2,1,null,null,null,null,null,1,null,null,1]
[]
[]
[7,"Bünnerstede","Wesseling",1,1,null,null,null,null,null,null,1,null,null,null,null,null,null,null,null,2]
[null,null,"Haar"]
[null,null,"Neunkirchen",2,2,1]
[]
[]
[8,"Feistel","Wesseling",1,1]
[null,null,"Haar",1,1]
[null,null,"Neunkirchen",1,1,null,1,1,null,null,null,null,null,null,null,1]
[]
[]
[9,"Tikrani","Wesseling",1,1,null,null,null,null,null,null,1]
[null,null,"Haar"]
[null,null,"Neunkirchen"]
[]
[]
[10,"Herrmann","Wesseling",null,null,null,null,null,null,null,null,null,null,null,null,null,null,null,null,1]
[null,null,"Haar",1,1]
[null,null,"Neunkirchen"]
[]
[]
[11,"Flügge","Wesseling",null,null,null,null,null,null,null,null,null,null,null,null,null,null,null,null,null,1,1]
[null,null,"Haar",1,1,null,null,null,null,null,null,1,null,null,null,null,null,null,null,null,1,1]
[null,null,"Neunkirchen"]
[]
[]
[12,"Schade","Wesseling"]
[null,null,"Haar"]
[null,null,"Neunkirchen",1,1,null,null,1]
[]
[]
[13,"Heiland","Wesseling",1,1,null,2,1,null,1,null,null,null,null,null,null,null,null,null,null,null,1]
[null,null,"Haar"]
[null,null,"Neunkirchen",3,2,1,null,null,null,null,null,null,null,1]
[]
[]
[14,"Siering","Wesseling",null,null,null,null,null,null,null,null,null,null,null,null,null,null,null,null,null,null,1]
[null,null,"Haar",2,1,1,null,1,null,null,null,null,1,null,1,null,null,null,null,2,4]
[null,null,"Neunkirchen",4,3,1,null,1,null,null,null,1,1,null,null,1]
[]
[]
[15,"Rathjen","Wesseling"]
[null,null,"Haar",2,1,1,null,null,null,null,null,null,1,null,null,null,null,null,null,1,2,2]
[null,null,"Neunkirchen",2,1,1,null,null,null,null,null,null,1,null,1]
[]
[]
[16,"Ernst","Wesseling"]
[null,null,"Haar"]
[null,null,"Neunkirchen",4,3,2,null,2,null,null,null,null,1]
[]
[]
[17,"Flohr","Wesseling"]
[null,null,"Haar"]
[null,null,"Neunkirchen"]

{"sheet":"Knights 2","index":1,"n_rows":83,"n_cols":22,"rows_kept":83,"cut":false,"hidden":false,"merged":[[0,3,0,17],[0,19,0,21]]}
[null,null,null,"Offense",null,null,null,null,null,null,null,null,null,null,null,null,null,null,null,"Defense"]
["ID","Spieler","Gegner","PA","AB","R","RBI","H","2B","3B","HR","K","BB","HP","SB","CS","SH","SF",null,"A","PO","E"]
[18,"Lühr","Wesseling"]
[null,null,"Haar",2,2,null,null,null,null,null,null,1]
[null,null,"Neunkirchen",2,2,1,null,1]
[]
[]
[19,"Ottenberg","Wesseling"]
[null,null,"Haar",2,2,1,null,null,null,null,null,null,null,null,null,null,null,null,null,null,1]
[null,null,"Neunkirchen"]
[]
[]
[20,"Piotrowski","Wesseling"]
[null,null,"Haar",2,2,null,1,1,null,null,null,null,null,null,null,null,null,null,null,1]
[null,null,"Neunkirchen",1,1]
[]
[]
[600]
[]
[]
[]
[]
[205]
[]
[]
[]
[]
[206]
[]
[]
[]
[]
[207]
[]
[]
[]
[]
[208]
[]
[]
[]
[]
[209]
[]
[]
[]
[]
[210]
[]
[]
[]
[]
[211]
[]
[]
[]
[]
[212]
[]
[]
[]
[]
[213]
[]
[]
[]
[]
[214]
[]
[]
[]
[]
[215]
[]
[]
[]
[]
[216]
[]
[]
[]
[]
[217]

{"sheet":"Wesseling Vermins","index":2,"n_rows":83,"n_cols":22,"rows_kept":83,"cut":false,"hidden":false,"merged":[[0,3,0,17],[0,19,0,21]]}
[null,null,null,"Offense",null,null,null,null,null,null,null,null,null,null,null,null,null,null,null,"Defense"]
["ID","Spieler","Gegner","PA","AB","R","RBI","H","2B","3B","HR","K","BB","HP","SB","CS","SH","SF",null,"A","PO","E"]
[21,"Dunford","Hamburg",4,1,2,1,null,null,null,null,null,3,null,1,null,null,null,null,null,5]
[null,null,"Haar",4,2,3,2,1,1,null,null,null,2,null,null,null,null,null,null,null,6]
[null,null,"Freising",2,2,null,null,null,null,null,null,null,null,null,null,null,null,null,null,1,8]
[null,null,"Haar",3,2,1,null,null,null,null,null,1,1,null,1,null,null,null,null,1,11]
[]
[22,"Schlitzer","Hamburg",3,2,2,1,null,null,null,null,null,1,null,1]
[null,null,"Haar",4,3,1,2,1,null,null,null,null,null,null,1,null,1,null,null,2,null,2]
[null,null,"Freising",2,2,null,null,null,null,null,null,null,null,null,null,null,null,null,null,1,null,3]
[null,null,"Haar",3,3,null,null,null,null,null,null,null,null,null,null,null,null,null,null,1,1,1]
[]
[23,"Seitz","Hamburg",2,1,2,1,null,null,null,null,null,1]
[null,null,"Haar",4,2,null,1,null,null,null,null,null,null,null,null,null,2]
[null,null,"Freising",2,2,null,null,null,null,null,null,1]
[null,null,"Haar",3,3,null,1]
[]
[24,"Dickmeiss","Hamburg",3,null,2,null,null,null,null,null,null,3,null,null,null,null,null,null,1]
[null,null,"Haar",4,3,4,1,2,1,null,null,null,1,null,2]
[null,null,"Freising",2,2,null,null,1,null,null,null,null,null,null,null,null,null,null,null,2]
[null,null,"Haar",3,3,1,null,1,1,null,null,null,null,null,3]
[]
[25,"Thies","Hamburg",3,null,2,null,null,null,null,null,null,3]
[null,null,"Haar",4,3,2,1,2,1,null,null,null,1,null,null,null,null,null,null,1,2]
[null,null,"Freising",2,2,null,null,null,null,null,null,1]
[null,null,"Haar",3,3,null,null,null,null,null,null,3]
[]
[26,"Reisenauer","Hamburg",3,3,1,2]
[null,null,"Haar",4,1,null,1,1,null,null,null,null,1,null,null,null,2,null,null,4,1]
[null,null,"Freising",2,2,null,null,null,null,null,null,1,null,null,null,null,null,null,null,1,1]
[null,null,"Haar",3,3,null,1,null,null,null,null,1,null,null,null,null,null,null,null,4,1]
[]
[27,"Ziegler","Hamburg",2,1,1,null,null,null,null,null,1,1]
[null,null,"Haar",4,3,null,null,null,null,null,null,1,1]
[null,null,"Freising",2,2,null,null,null,null,null,null,2]
[null,null,"Haar",3,3,null,null,null,null,null,null,1]
[]
[28,"Wolff","Hamburg",3,1,1,1,null,null,null,null,null,2]
[null,null,"Haar",3,1,1,null,null,null,null,null,null,2,null,null,null,null,null,null,null,1]
[null,null,"Freising"]
[null,null,"Haar",2,2,null,null,null,null,null,null,1,null,null,null,null,null,null,null,null,1]
[]
[29,"Kowalewski","Hamburg",3,3,1,1,1,null,null,null,null,null,null,null,null,null,null,null,null,3]
[null,null,"Haar",3,2,2,null,1,null,null,null,null,1,null,null,null,null,null,null,null,5]
[null,null,"Freising",1,1,null,null,null,null,null,null,1,null,null,null,null,null,null,null,null,5,1]
[null,null,"Haar",2,2,null,null,null,null,null,null,1,null,null,null,null,null,null,null,null,7]
[]
[30,"Seiden","Hamburg",1,null,1,null,null,null,null,null,null,null,1]
[null,null,"Haar"]
[null,null,"Freising",null,null,null,null,null,null,null,null,null,null,null,null,null,null,null,null,null,1]
[null,null,"Haar"]
[]
[31,"Erden","Hamburg",1,null,null,null,null,null,null,null,null,1]
[null,null,"Haar",1,1]
[null,null,"Freising",1,1,null,null,null,null,null,null,1]
[null,null,"Haar"]
[]
[]
[]
[]
[]
[]
[313]
[]
[]
[]
[]
[314]
[]
[]
[]
[]
[315]
[]
[]
[]
[]
[316]
[]
[]
[]
[]
[317]

{"sheet":"Freising Grizzlies","index":3,"n_rows":83,"n_cols":22,"rows_kept":83,"cut":false,"hidden":false,"merged":[[0,3,0,17],[0,19,0,21]]}
[null,null,null,"Offense",null,null,null,null,null,null,null,null,null,null,null,null,null,null,null,"Defense"]
["ID","Spieler","Gegner","PA","AB","R","RBI","H","2B","3B","HR","K","BB","HP","SB","CS","SH","SF",null,"A","PO","E"]
[32,"Biswas, T.","Karlsruhe",4,1,1,1,null,null,null,null,null,3,null,null,null,null,null,null,2,null,2]
[null,null,"Neunkirchen",3,3,1,2,1,1,null,null,1,null,null,1,null,null,null,null,null,4]
[null,null,"Wesseling",3,3,1,null,1,1,null,null,1]
[null,null,"Haar",3,2,1,null,null,null,null,null,null,1]
[]
[33,"Eschke","Karlsruhe",1,null,null,null,null,null,null,null,null,1]
[null,null,"Neunkirchen",1,1,null,null,null,null,null,null,1]
[null,null,"Wesseling",1,1,null,null,null,null,null,null,1]
[null,null,"Haar"]
[]
[34,"Mann","Karlsruhe"]
[null,null,"Neunkirchen",1,1,null,1]
[null,null,"Wesseling"]
[null,null,"Haar"]
[]
[35,"Sandner","Karlsruhe",4,3,3,null,2,null,null,null,null,1,null,null,null,null,null,null,2,1,1]
[null,null,"Neunkirchen",4,3,4,2,2,null,null,null,null,1,null,null,null,null,null,null,null,2]
[null,null,"Wesseling",4,4,2,null,3,null,null,null,1,null,null,1,null,null,null,null,2,1]
[null,null,"Haar",4,3,3,2,1,1,null,null,null,1,null,1,null,null,null,null,3]
[]
[36,"Salomon","Karlsruhe",4,3,2,1,1,null,null,null,null,1,null,null,null,null,null,null,1]
[null,null,"Neunkirchen",4,3,3,2,1,null,null,null,null,1,null,null,null,null,null,null,1,1]
[null,null,"Wesseling",4,3,null,1,null,null,null,null,null,1]
[null,null,"Haar",4,1,1,null,null,null,null,null,1,1,null,1,null,1]
[]
[37,"Steffen","Karlsruhe",4,2,3,2,1,1,null,null,null,2,null,null,null,null,null,null,1,1]
[null,null,"Neunkirchen",4,2,2,null,1,null,null,null,null,1,1,null,null,null,null,null,1,1]
[null,null,"Wesseling",4,4,1,1,1,null,null,null,null,null,null,null,null,null,null,null,2]
[null,null,"Haar",4,2,2,2,1,1,null,null,null,1,null,1,null,1,null,null,4,2]
[]
[38,"Biswas, L.","Karlsruhe",4,3,2,3,2,1,null,null,null,null,null,null,null,null,1,null,1,1,1]
[null,null,"Neunkirchen",4,4,2,4,2,1,1,null,1,null,null,null,null,null,null,null,null,1]
[null,null,"Wesseling",3,3,1,2,2,null,1,null,null,null,null,null,null,null,null,null,1]
[null,null,"Haar",3,2,null,2,1,1,null,null,null,null,null,null,null,null,1,null,2]
[]
[39,"Kerscher","Karlsruhe",4,1,1,2,null,null,null,null,null,2,null,null,null,null,1,null,null,5]
[null,null,"Neunkirchen"]
[null,null,"Wesseling",3,2,2,1,1,1,null,null,1,1,null,null,null,null,null,null,1,6]
[null,null,"haar",3,3,null,null,1,null,null,null,null,null,null,null,1,null,null,null,null,5]
[]
[40,"Brosch","Karlsruhe",3,3,1,null,2,null,null,null,null,null,null,null,null,null,null,null,null,6,1]
[null,null,"Neunkirchen",4,3,1,null,1,null,null,null,null,1,null,null,1,null,null,null,2,2]
[null,null,"Wesseling",3,3,null,null,null,null,null,null,2,null,null,null,null,null,null,null,null,6]
[null,null,"Haar",3,2,1,null,1,null,null,null,null,null,null,1,null,1,null,null,null,8]
[]
[41,"Thürmer","Karlsruhe",3,3,1,1,1,null,null,null,null,null,null,null,null,null,null,null,1,1]
[null,null,"Neunkirchen",4,4,3,null,2,null,1,null,null,null,null,null,null,null,null,null,3,1]
[null,null,"Wesseling",3,3,2,2,2,null,null,null,1,null,null,null,null,null,null,null,2,2]
[null,null,"Haar",3,3,null,null,null,null,null,null,1,null,null,null,null,null,null,null,2,1]
[]
[42,"Zimmernmann","Karlsruhe",3,1,2,null,null,null,null,null,null,2]
[null,null,"Neunkirchen",2,1,2,1,1,null,1,null,null,null,1]
[null,null,"Wesseling",3,1,1,null,null,null,null,null,1,2]
[null,null,"Haar",3,2,1,null,1,null,null,null,null,1,null,1]
[]
[412,"Schnirch","Haar",null,null,null,null,null,null,null,null,null,null,null,null,null,null,null,null,null,2,1]
[]
[]
[]
[]
[413]
[]
[]
[]
[]
[414]
[]
[]
[]
[]
[415]
[]
[]
[]
[]
[416]
[]
[]
[]
[]
[417]

{"sheet":"Haar Disciples","index":4,"n_rows":83,"n_cols":22,"rows_kept":83,"cut":false,"hidden":false,"merged":[[0,3,0,17],[0,19,0,21]]}
[null,null,null,"Offense",null,null,null,null,null,null,null,null,null,null,null,null,null,null,null,"Defense"]
["ID","Spieler","Gegner","PA","AB","R","RBI","H","2B","3B","HR","K","BB","HP","SB","CS","SH","SF",null,"A","PO","E"]
[43,"Stepniak","Hamburg",4,4,4,null,2,null,2,null,null,null,null,1,null,null,null,null,2]
[null,null,"Wesseling",3,3,1,null,1,null,null,null,1,null,null,null,null,null,null,null,2]
[null,null,"Karlsruhe",4,3,1,1,1,null,null,null,null,1,null,null,null,null,null,null,1,4,1]
[null,null,"Wesseling",4,4,2,null,2,null,null,null,null,null,null,1,null,null,null,null,6,1]
[null,null,"Freising",3,1,null,null,null,null,null,null,null,1,1,1,null,null,null,null,2,2]
[44,"Gruber","Hamburg",3,2,1,3,2,null,null,null,null,1,null,1,null,null,null,null,null,7]
[null,null,"Wesseling",3,3,1,null,1,1,null,null,null,null,null,null,null,null,null,null,null,12,2]
[null,null,"Karlsruhe",4,2,1,null,null,null,null,null,null,2,null,null,null,null,null,null,1,6,1]
[null,null,"Wesseling",4,3,1,3,3,null,null,2,null,1,null,null,null,null,null,null,6,1]
[null,null,"Freising",3,2,null,1,1,null,null,null,null,1,null,1,null,null,null,null,2,3]
[45,"Laack","Hamburg",4,3,2,null,1,null,null,null,1,1]
[null,null,"Wesseling",2,2]
[null,null,"Karlsruhe",4,4,1,1,2,null,1,null,null,null,null,null,null,null,null,null,1,1]
[null,null,"Wesseling",4,4,1,1,1,null,null,null,2]
[null,null,"Freising",3,3,null,null,null,null,null,null,1,null,null,null,null,null,null,null,null,2,1]
[46,"Reinisch, Kat","Hamburg",3,1,1,null,null,null,null,null,null,2,null,null,null,null,null,null,null,3]
[null,null,"Wesseling",2,2,null,2,1,1,null,null,null,null,null,null,null,null,null,null,5,2,1]
[null,null,"Karlsruhe",4,2,1,null,null,null,null,null,1,2,null,null,null,null,null,null,2,2]
[null,null,"Wesseling",4,4,null,1,2,1,null,null,2,null,null,null,null,null,null,null,1,7]
[null,null,"Freising"]
[47,"Mohr","Hamburg",3,1,2,1,null,null,null,null,null,2]
[null,null,"Wesseling",2,2,null,null,null,null,null,null,2,null,null,null,null,null,null,null,1]
[null,null,"Karlsruhe",3,3,1,null,1,null,null,null,1,null,null,null,null,null,null,null,null,2]
[null,null,"Wesseling",2,1,null,null,null,null,null,null,null,1,null,1]
[null,null,"Freising",2,null,1,null,null,null,null,null,null,2,null,null,null,null,null,null,2,4,1]
[48,"Wiele","Hamburg",3,2,1,null,null,null,null,null,null,1,null,1]
[null,null,"Wesseling",2,2,null,null,null,null,null,null,1]
[null,null,"Karlsruhe",4,3,null,1,null,null,null,null,null,null,null,null,null,1]
[null,null,"Wesseling",3,3,1,null,1,null,null,null,2]
[null,null,"Freising",3,3,null,null,1,null,null,null,1]
[49,"Marric","Hamburg",3,2,3,1,1]
[null,null,"Wesseling",null,null,null,null,null,null,null,null,null,null,null,null,null,null,null,null,1]
[null,null,"Karlsruhe",3,3,1,null,1]
[null,null,"Wesseling",4,4,1,null,2,null,null,null,1]
[null,null,"Freising",3,2,null,null,1,null,null,null,null,1,null,null,null,null,null,null,null,1]
[50,"Reinisch, Sophie","Hamburg",4,2,2,2,1,null,null,null,null,2,null,2,null,null,null,null,2]
[null,null,"Wesseling",2,2,null,null,null,null,null,null,null,null,null,null,null,null,null,null,null,null,1]
[null,null,"Karlsruhe",3,3,1,null,1,null,null,null,null,null,null,null,null,null,null,null,1,1,1]
[null,null,"Wesseling",4,3,null,1,null,null,null,null,1,1,null,null,null,null,null,null,4,2]
[null,null,"Freising",4,3,null,1,1,null,null,null,null,null,1]
[51,"Ruziourouh","Hamburg",4,3,2,2,1,null,null,null,null,1]
[null,null,"Wesseling"]
[null,null,"Karlsruhe",4,3,2,2,3,1,null,null,null,1,null,null,null,null,null,null,2]
[null,null,"Wesseling",4,4,null,null,1]
[null,null,"Freising",4,4,1]
[52,"Huber","Hamburg",1,null,2,null,null,null,null,null,null,1,null,null,null,null,null,null,1,2]
[null,null,"Wesseling"]
[null,null,"Karlsruhe",null,null,null,null,null,null,null,null,null,null,null,null,null,null,null,null,3,1]
[null,null,"Wesseling",null,null,null,null,null,null,null,null,null,null,null,null,null,null,null,null,2,2,2]
[null,null,"Freising"]
[53,"Gomilschak","Hamburg",1,1]
[null,null,"Wesseling",1,1,null,null,null,null,null,null,1,null,null,null,null,null,null,null,null,1,1]
[null,null,"Karlsruhe"]
[null,null,"Wesseling"]
[null,null,"Freising"]
[54,"Knallhuber","Hamburg",1,null,null,null,null,null,null,null,null,null,1]
[null,null,"Wesseling"]
[null,null,"Karlsruhe",1,1]
[null,null,"Wesseling",1,1,null,null,null,null,null,null,1]
[null,null,"Freising",1,1,null,null,null,null,null,null,1]
[55,"Harvey","Hamburg",1,null,1,1,null,null,null,null,null,1]
[null,null,"Wesseling"]
[null,null,"Karlsruhe"]
[null,null,"Wesseling",1,1,null,null,null,null,null,null,1]
[null,null,"Freising"]
[56,"Kuhles","Hamburg",1,1,null,null,null,null,null,null,1,1]
[null,null,"Wesseling"]
[null,null,"Karlsruhe"]
[null,null,"Wesseling"]
[null,null,"Freising"]
[515,"Pozgaj","Karlsruhe",1,1,null,null,null,null,null,null,null,null,null,null,null,null,null,null,1,4]
[null,null,"Wesseling"]
[null,null,"Freising"]
[]
[]
[516,"Kuprian","Wesseling",1,1,null,null,null,null,null,null,1]
[null,null,"Freising"]
[]
[]
[]
[517]

{"sheet":"Karlsruhe Cougars","index":5,"n_rows":83,"n_cols":22,"rows_kept":83,"cut":false,"hidden":false,"merged":[[0,3,0,17],[0,19,0,21]]}
[null,null,null,"Offense",null,null,null,null,null,null,null,null,null,null,null,null,null,null,null,"Defense"]
["ID","Spieler","Gegner","PA","AB","R","RBI","H","2B","3B","HR","K","BB","HP","SB","CS","SH","SF",null,"A","PO","E"]
[57,"Weil","Freising",3,3,3,null,3,1,null,null,null,null,null,1,null,null,null,null,1,2,1]
[null,null,"Neunkirchen",4,3,4,1,3,1,null,null,null,1,null,null,null,null,null,null,1,1]
[null,null,"Haar",5,5,3,1,3,1,null,null,1,null,null,1,null,null,null,null,2,2]
[]
[]
[58,"Seso","Freising",3,2,1,null,1,null,null,null,null,1,null,1,null,null,null,null,null,null,2]
[null,null,"Neunkirchen",4,4,1,1,1,null,null,null,2,null,null,null,null,null,null,null,2,6]
[null,null,"Haar",5,4,1,null,1,null,null,null,1,null,1,null,null,null,null,null,null,3,1]
[]
[]
[59,"Reibenspies","Freising",3,2,1,1,null,null,null,null,null,1,null,null,null,null,null,null,null,2]
[null,null,"Neunkirchen",4,3,2,3,2,2,null,null,null,1,null,2,null,null,null,null,3]
[null,null,"Haar",4,4,null,2,2,1,null,null,1,null,null,null,null,null,null,null,null,1,2]
[]
[]
[60,"Apel","Freising",3,2,1,1,1,null,null,null,null,null,1,null,null,null,null,null,null,3,3]
[null,null,"Neunkirchen",4,1,2,null,null,null,null,null,null,3,null,2,null,null,null,null,null,1,1]
[null,null,"Haar",4,2,null,null,null,null,null,null,null,2,null,1,null,null,null,null,1,5,1]
[]
[]
[61,"Sturm","Freising",3,3,null,null,null,null,null,null,1,null,null,null,null,null,null,null,1]
[null,null,"Neunkirchen",3,2,2,1,null,null,null,null,null,1,null,null,null,null,null,null,null,1,1]
[null,null,"Haar",4,2,null,null,null,null,null,null,null,2,null,null,null,null,null,null,2,3]
[]
[]
[62,"Malmbeck","Freising",3,3,null,null,null,null,null,null,3,null,null,null,null,null,null,null,1]
[null,null,"Neunkirchen",3,2,1,null,null,null,null,null,null,1,null,null,null,null,null,null,1]
[null,null,"Haar",4,2,1,1,null,null,null,null,null,1,1]
[]
[]
[63,"Kortenkamp","Freising",3,3,1,null,1,null,null,null,null,null,null,null,null,null,null,null,1,3]
[null,null,"Neunkirchen",3,3,null,3,2,null,null,null,1,null,null,1]
[null,null,"Haar",4,2,null,1,1,null,null,null,null,null,1,1,null,null,1,null,1,1,1]
[]
[]
[64,"Müller","Freising",3,3,null,null,1,null,null,null,null,null,null,null,null,null,null,null,null,1]
[null,null,"Neunkirchen",4,4,3,null,2,null,null,null,null,null,null,null,null,null,null,null,1,1]
[null,null,"Haar",4,4,1,null,1,null,null,null,1,null,null,null,null,null,null,null,1,2,1]
[]
[]
[65,"Rauprich","Freising",3,2,null,null,null,null,null,null,1,1,null,null,null,null,null,null,null,1]
[null,null,"Neunkirchen",3,2,2,1,1,null,null,null,null,1,null,null,null,null,null,null,null,2,1]
[null,null,"Haar",4,1,1,null,null,null,null,null,1,3,null,null,null,null,null,null,2,1]
[]
[]
[66]
[]
[]
[]
[]
[611]
[]
[]
[]
[]
[612]
[]
[]
[]
[]
[613]
[]
[]
[]
[]
[614]
[]
[]
[]
[]
[615]
[]
[]
[]
[]
[616]
[]
[]
[]
[]
[617]

{"sheet":"Neunkirchen Nightmares","index":6,"n_rows":83,"n_cols":22,"rows_kept":83,"cut":false,"hidden":false,"merged":[[0,3,0,17],[0,19,0,21]]}
[null,null,null,"Offense",null,null,null,null,null,null,null,null,null,null,null,null,null,null,null,"Defense"]
["ID","Spieler","Gegner","PA","AB","R","RBI","H","2B","3B","HR","K","BB","HP","SB","CS","SH","SF",null,"A","PO","E"]
[67,"Lamersdorf","Karlsruhe",3,3,2,null,1,null,null,null,1,null,null,null,null,null,null,null,null,5,1]
[null,null,"Freising",4,2,1,null,null,null,null,null,null,2,null,null,null,null,null,null,2,2,2]
[null,null,"Hamburg",4,2,1,1,null,null,null,null,null,2,null,1]
[]
[]
[68,"Fischer","Karlsruhe",3,2,1,null,null,null,null,null,1,1,null,null,null,null,null,null,null,null,1]
[null,null,"Freising",3,2,1,null,null,null,null,null,null,1,null,null,null,null,null,null,2,1]
[null,null,"Hamburg",4,2,1,2,null,null,null,null,null,2,null,2]
[]
[]
[69,"Weyer","Karlsruhe",2,0,2,null,null,null,null,null,null,2,null,null,null,null,null,null,null,null,3]
[null,null,"Freising",3,3,null,null,null,null,null,null,null,null,null,null,null,null,null,null,2,1]
[null,null,"Hamburg",4,3,2,null,1,null,null,null,null,1,null,1]
[]
[]
[70,"Parpart","Karlsruhe",2,1,null,3,1,null,1,null,null,1,null,2,null,null,null,null,2,2,1]
[null,null,"Freising",2,2,1,1,1,1,null,null,null,null,null,null,null,null,null,null,1,4,2]
[null,null,"Hamburg",3,0,3,null,null,null,null,null,null,3,null,2]
[]
[]
[71,"Cadsky","Karlsruhe",2,1,null,1,null,null,null,null,null,null,null,null,null,null,1,null,1,2]
[null,null,"Freising",2,1,1,2,1,null,null,null,null,1,null,1,null,null,null,null,null,3]
[null,null,"Hamburg",3,1,2,1,1,null,null,null,null,1,null,null,null,null,1]
[]
[]
[72,"Singer","Karlsruhe",2,1,null,null,1,null,null,null,null,1,null,3,null,null,null,null,null,null,2]
[null,null,"Freising",2,1,null,null,null,null,null,null,1,1]
[null,null,"Hamburg",3,3]
[]
[]
[73,"Hupperich","Karlsruhe",2,1,null,null,null,null,null,null,1,1]
[null,null,"Freising",2,null,null,null,null,null,null,null,null,2,null,null,null,null,null,null,1]
[null,null,"Hamburg",3,1,2,null,null,null,null,null,1,2,null,2]
[]
[]
[74,"Kaufner","Karlsruhe",2,2,null,null,null,null,null,null,2]
[null,null,"Freising",2,null,null,null,null,null,null,null,null,2]
[null,null,"Hamburg",3,0,2,1,null,null,null,null,null,2,null,null,null,1]
[]
[]
[75,"Pietrzyt","Karlsruhe",2,2,null,null,null,null,null,null,null,null,null,null,null,null,null,null,1,1]
[null,null,"Freising",3,1,null,null,null,null,null,null,1,2,null,null,null,null,null,null,null,null,2]
[null,null,"Hamburg",3,3,1,1,2]
[]
[]
[710]
[]
[]
[]
[]
[711]
[]
[]
[]
[]
[712]
[]
[]
[]
[]
[713]
[]
[]
[]
[]
[714]
[]
[]
[]
[]
[715]
[]
[]
[]
[]
[716]
[]
[]
[]
[]
[717]

{"sheet":"Team 8","index":7,"n_rows":83,"n_cols":22,"rows_kept":83,"cut":false,"hidden":false,"merged":[[0,3,0,17],[0,19,0,21]]}
[null,null,null,"Offense",null,null,null,null,null,null,null,null,null,null,null,null,null,null,null,"Defense"]
["ID","Spieler","Gegner","PA","AB","R","RBI","H","2B","3B","HR","K","BB","HP","SB","CS","SH","SF",null,"A","PO","E"]
[801]
[]
[]
[]
[]
[802]
[]
[]
[]
[]
[803]
[]
[]
[]
[]
[804]
[]
[]
[]
[]
[805]
[]
[]
[]
[]
[806]
[]
[]
[]
[]
[807]
[]
[]
[]
[]
[808]
[]
[]
[]
[]
[809]
[]
[]
[]
[]
[810]
[]
[]
[]
[]
[811]
[]
[]
[]
[]
[812]
[]
[]
[]
[]
[813]
[]
[]
[]
[]
[814]
[]
[]
[]
[]
[815]
[]
[]
[]
[]
[816]
[]
[]
[]
[]
[817]

{"sheet":"Offense Leaders","index":8,"n_rows":138,"n_cols":29,"rows_kept":138,"cut":false,"hidden":false,"merged":[[0,2,0,16],[0,18,0,20],[0,22,0,26]]}
[null,null,"Offense",null,null,null,null,null,null,null,null,null,null,null,null,null,null,null,"Defense",null,null,null,"Percentage"]
["ID","Spieler","PA","AB","R","RBI","H","2B","3B","HR","K","BB","HP","SB","CS","SH","SF",null,"A","PO","E",null,"AVG","SLG","AVG+SLG","OBP","OPS",null,"FLD"]
[{"$f":"'Neunkirchen Nightmares'!A18","v":70},{"$f":"IF('Neunkirchen Nightmares'!B18=\"\",\"\",'Neunkirchen Nightmares'!B18)","v":"Parpart"},{"$f":"SUM('Neunkirchen Nightmares'!D18:D22)","v":7},{"$f":"SUM('Neunkirchen Nightmares'!E18:E22)","v":3},{"$f":"SUM('Neunkirchen Nightmares'!F18:F22)","v":4},{"$f":"SUM('Neunkirchen Nightmares'!G18:G22)","v":4},{"$f":"SUM('Neunkirchen Nightmares'!H18:H22)","v":2},{"$f":"SUM('Neunkirchen Nightmares'!I18:I22)","v":1},{"$f":"SUM('Neunkirchen Nightmares'!J18:J22)","v":1},{"$f":"SUM('Neunkirchen Nightmares'!K18:K22)","v":0},{"$f":"SUM('Neunkirchen Nightmares'!L18:L22)","v":0},{"$f":"SUM('Neunkirchen Nightmares'!M18:M22)","v":4},{"$f":"SUM('Neunkirchen Nightmares'!N18:N22)","v":0},{"$f":"SUM('Neunkirchen Nightmares'!O18:O22)","v":4},{"$f":"SUM('Neunkirchen Nightmares'!P18:P22)","v":0},{"$f":"SUM('Neunkirchen Nightmares'!Q18:Q22)","v":0},{"$f":"SUM('Neunkirchen Nightmares'!R18:R22)","v":0},null,{"$f":"SUM('Neunkirchen Nightmares'!T18:T22)","v":3},{"$f":"SUM('Neunkirchen Nightmares'!U18:U22)","v":6},{"$f":"SUM('Neunkirchen Nightmares'!V18:V22)","v":3},null,{"$f":"IF(ISERROR(G3/D3),0,G3/D3)","v":0.66666666666666663},{"$f":"IF(ISERROR((4*J3+3*I3+2*H3+G3-SUM(H3:J3))/D3),0,(4*J3+3*I3+2*H3+G3-SUM(H3:J3))/D3)","v":1.6666666666666667},{"$f":"W3+X3","v":2.3333333333333335},{"$f":"IF(ISERROR((G3+L3+M3)/(D3+L3+M3+Q3)),0,(G3+L3+M3)/(D3+L3+M3+Q3))","v":0.8571428571428571},{"$f":"Z3+X3","v":2.5238095238095237},null,{"$f":"IF(ISERROR((S3+T3)/(U3+S3+T3)),0,(S3+T3)/(U3+S3+T3))","v":0.75}]
[{"$f":"'Haar Disciples'!A8","v":44},{"$f":"IF('Haar Disciples'!B8=\"\",\"\",'Haar Disciples'!B8)","v":"Gruber"},{"$f":"SUM('Haar Disciples'!D8:D12)","v":17},{"$f":"SUM('Haar Disciples'!E8:E12)","v":12},{"$f":"SUM('Haar Disciples'!F8:F12)","v":4},{"$f":"SUM('Haar Disciples'!G8:G12)","v":7},{"$f":"SUM('Haar Disciples'!H8:H12)","v":7},{"$f":"SUM('Haar Disciples'!I8:I12)","v":1},{"$f":"SUM('Haar Disciples'!J8:J12)","v":0},{"$f":"SUM('Haar Disciples'!K8:K12)","v":2},{"$f":"SUM('Haar Disciples'!L8:L12)","v":0},{"$f":"SUM('Haar Disciples'!M8:M12)","v":5},{"$f":"SUM('Haar Disciples'!N8:N12)","v":0},{"$f":"SUM('Haar Disciples'!O8:O12)","v":2},{"$f":"SUM('Haar Disciples'!P8:P12)","v":0},{"$f":"SUM('Haar Disciples'!Q8:Q12)","v":0},{"$f":"SUM('Haar Disciples'!R8:R12)","v":0},null,{"$f":"SUM('Haar Disciples'!T8:T12)","v":9},{"$f":"SUM('Haar Disciples'!U8:U12)","v":29},{"$f":"SUM('Haar Disciples'!V8:V12)","v":3},null,{"$f":"IF(ISERROR(G4/D4),0,G4/D4)","v":0.58333333333333337},{"$f":"IF(ISERROR((4*J4+3*I4+2*H4+G4-SUM(H4:J4))/D4),0,(4*J4+3*I4+2*H4+G4-SUM(H4:J4))/D4)","v":1.1666666666666667},{"$f":"W4+X4","v":1.75},{"$f":"IF(ISERROR((G4+L4+M4)/(D4+L4+M4+Q4)),0,(G4+L4+M4)/(D4+L4+M4+Q4))","v":0.70588235294117652},{"$f":"Z4+X4","v":1.8725490196078431},null,{"$f":"IF(ISERROR((S4+T4)/(U4+S4+T4)),0,(S4+T4)/(U4+S4+T4))","v":0.92682926829268297}]
[{"$f":"'Hamburg Knights'!A58","v":12},{"$f":"IF('Hamburg Knights'!B58=\"\",\"\",'Hamburg Knights'!B58)","v":"Schade"},{"$f":"SUM('Hamburg Knights'!D58:D62)","v":1},{"$f":"SUM('Hamburg Knights'!E58:E62)","v":1},{"$f":"SUM('Hamburg Knights'!F58:F62)","v":0},{"$f":"SUM('Hamburg Knights'!G58:G62)","v":0},{"$f":"SUM('Hamburg Knights'!H58:H62)","v":1},{"$f":"SUM('Hamburg Knights'!I58:I62)","v":0},{"$f":"SUM('Hamburg Knights'!J58:J62)","v":0},{"$f":"SUM('Hamburg Knights'!K58:K62)","v":0},{"$f":"SUM('Hamburg Knights'!L58:L62)","v":0},{"$f":"SUM('Hamburg Knights'!M58:M62)","v":0},{"$f":"SUM('Hamburg Knights'!N58:N62)","v":0},{"$f":"SUM('Hamburg Knights'!O58:O62)","v":0},{"$f":"SUM('Hamburg Knights'!P58:P62)","v":0},{"$f":"SUM('Hamburg Knights'!Q58:Q62)","v":0},{"$f":"SUM('Hamburg Knights'!R58:R62)","v":0},null,{"$f":"SUM('Hamburg Knights'!T58:T62)","v":0},{"$f":"SUM('Hamburg Knights'!U58:U62)","v":0},{"$f":"SUM('Hamburg Knights'!V58:V62)","v":0},null,{"$f":"IF(ISERROR(G5/D5),0,G5/D5)","v":1},{"$f":"IF(ISERROR((4*J5+3*I5+2*H5+G5-SUM(H5:J5))/D5),0,(4*J5+3*I5+2*H5+G5-SUM(H5:J5))/D5)","v":1},{"$f":"W5+X5","v":2},{"$f":"IF(ISERROR((G5+L5+M5)/(D5+L5+M5+Q5)),0,(G5+L5+M5)/(D5+L5+M5+Q5))","v":1},{"$f":"Z5+X5","v":2},null,{"$f":"IF(ISERROR((S5+T5)/(U5+S5+T5)),0,(S5+T5)/(U5+S5+T5))","v":0}]
[{"$f":"'Karlsruhe Cougars'!A3","v":57},{"$f":"IF('Karlsruhe Cougars'!B3=\"\",\"\",'Karlsruhe Cougars'!B3)","v":"Weil"},{"$f":"SUM('Karlsruhe Cougars'!D3:D7)","v":12},{"$f":"SUM('Karlsruhe Cougars'!E3:E7)","v":11},{"$f":"SUM('Karlsruhe Cougars'!F3:F7)","v":10},{"$f":"SUM('Karlsruhe Cougars'!G3:G7)","v":2},{"$f":"SUM('Karlsruhe Cougars'!H3:H7)","v":9},{"$f":"SUM('Karlsruhe Cougars'!I3:I7)","v":3},{"$f":"SUM('Karlsruhe Cougars'!J3:J7)","v":0},{"$f":"SUM('Karlsruhe Cougars'!K3:K7)","v":0},{"$f":"SUM('Karlsruhe Cougars'!L3:L7)","v":1},{"$f":"SUM('Karlsruhe Cougars'!M3:M7)","v":1},{"$f":"SUM('Karlsruhe Cougars'!N3:N7)","v":0},{"$f":"SUM('Karlsruhe Cougars'!O3:O7)","v":2},{"$f":"SUM('Karlsruhe Cougars'!P3:P7)","v":0},{"$f":"SUM('Karlsruhe Cougars'!Q3:Q7)","v":0},{"$f":"SUM('Karlsruhe Cougars'!R3:R7)","v":0},null,{"$f":"SUM('Karlsruhe Cougars'!T3:T7)","v":4},{"$f":"SUM('Karlsruhe Cougars'!U3:U7)","v":5},{"$f":"SUM('Karlsruhe Cougars'!V3:V7)","v":1},null,{"$f":"IF(ISERROR(G6/D6),0,G6/D6)","v":0.81818181818181823},{"$f":"IF(ISERROR((4*J6+3*I6+2*H6+G6-SUM(H6:J6))/D6),0,(4*J6+3*I6+2*H6+G6-SUM(H6:J6))/D6)","v":1.0909090909090908},{"$f":"W6+X6","v":1.9090909090909092},{"$f":"IF(ISERROR((G6+L6+M6)/(D6+L6+M6+Q6)),0,(G6+L6+M6)/(D6+L6+M6+Q6))","v":0.83333333333333337},{"$f":"Z6+X6","v":1.9242424242424243},null,{"$f":"IF(ISERROR((S6+T6)/(U6+S6+T6)),0,(S6+T6)/(U6+S6+T6))","v":0.9}]
[{"$f":"'Freising Grizzlies'!A53","v":42},{"$f":"IF('Freising Grizzlies'!B53=\"\",\"\",'Freising Grizzlies'!B53)","v":"Zimmernmann"},{"$f":"SUM('Freising Grizzlies'!D53:D57)","v":11},{"$f":"SUM('Freising Grizzlies'!E53:E57)","v":5},{"$f":"SUM('Freising Grizzlies'!F53:F57)","v":6},{"$f":"SUM('Freising Grizzlies'!G53:G57)","v":1},{"$f":"SUM('Freising Grizzlies'!H53:H57)","v":2},{"$f":"SUM('Freising Grizzlies'!I53:I57)","v":0},{"$f":"SUM('Freising Grizzlies'!J53:J57)","v":1},{"$f":"SUM('Freising Grizzlies'!K53:K57)","v":0},{"$f":"SUM('Freising Grizzlies'!L53:L57)","v":1},{"$f":"SUM('Freising Grizzlies'!M53:M57)","v":5},{"$f":"SUM('Freising Grizzlies'!N53:N57)","v":1},{"$f":"SUM('Freising Grizzlies'!O53:O57)","v":1},{"$f":"SUM('Freising Grizzlies'!P53:P57)","v":0},{"$f":"SUM('Freising Grizzlies'!Q53:Q57)","v":0},{"$f":"SUM('Freising Grizzlies'!R53:R57)","v":0},null,{"$f":"SUM('Freising Grizzlies'!T53:T57)","v":0},{"$f":"SUM('Freising Grizzlies'!U53:U57)","v":0},{"$f":"SUM('Freising Grizzlies'!V53:V57)","v":0},null,{"$f":"IF(ISERROR(G7/D7),0,G7/D7)","v":0.4},{"$f":"IF(ISERROR((4*J7+3*I7+2*H7+G7-SUM(H7:J7))/D7),0,(4*J7+3*I7+2*H7+G7-SUM(H7:J7))/D7)","v":0.8},{"$f":"W7+X7","v":1.2000000000000002},{"$f":"IF(ISERROR((G7+L7+M7)/(D7+L7+M7+Q7)),0,(G7+L7+M7)/(D7+L7+M7+Q7))","v":0.72727272727272729},{"$f":"Z7+X7","v":1.5272727272727273},null,{"$f":"IF(ISERROR((S7+T7)/(U7+S7+T7)),0,(S7+T7)/(U7+S7+T7))","v":0}]
[{"$f":"'Freising Grizzlies'!A33","v":38},{"$f":"IF('Freising Grizzlies'!B33=\"\",\"\",'Freising Grizzlies'!B33)","v":"Biswas, L."},{"$f":"SUM('Freising Grizzlies'!D33:D37)","v":14},{"$f":"SUM('Freising Grizzlies'!E33:E37)","v":12},{"$f":"SUM('Freising Grizzlies'!F33:F37)","v":5},{"$f":"SUM('Freising Grizzlies'!G33:G37)","v":11},{"$f":"SUM('Freising Grizzlies'!H33:H37)","v":7},{"$f":"SUM('Freising Grizzlies'!I33:I37)","v":3},{"$f":"SUM('Freising Grizzlies'!J33:J37)","v":2},{"$f":"SUM('Freising Grizzlies'!K33:K37)","v":0},{"$f":"SUM('Freising Grizzlies'!L33:L37)","v":1},{"$f":"SUM('Freising Grizzlies'!M33:M37)","v":0},{"$f":"SUM('Freising Grizzlies'!N33:N37)","v":0},{"$f":"SUM('Freising Grizzlies'!O33:O37)","v":0},{"$f":"SUM('Freising Grizzlies'!P33:P37)","v":0},{"$f":"SUM('Freising Grizzlies'!Q33:Q37)","v":0},{"$f":"SUM('Freising Grizzlies'!R33:R37)","v":2},null,{"$f":"SUM('Freising Grizzlies'!T33:T37)","v":4},{"$f":"SUM('Freising Grizzlies'!U33:U37)","v":2},{"$f":"SUM('Freising Grizzlies'!V33:V37)","v":1},null,{"$f":"IF(ISERROR(G8/D8),0,G8/D8)","v":0.58333333333333337},{"$f":"IF(ISERROR((4*J8+3*I8+2*H8+G8-SUM(H8:J8))/D8),0,(4*J8+3*I8+2*H8+G8-SUM(H8:J8))/D8)","v":1.1666666666666667},{"$f":"W8+X8","v":1.75},{"$f":"IF(ISERROR((G8+L8+M8)/(D8+L8+M8+Q8)),0,(G8+L8+M8)/(D8+L8+M8+Q8))","v":0.5},{"$f":"Z8+X8","v":1.6666666666666667},null,{"$f":"IF(ISERROR((S8+T8)/(U8+S8+T8)),0,(S8+T8)/(U8+S8+T8))","v":0.8571428571428571}]
[{"$f":"'Hamburg Knights'!A13","v":3},{"$f":"IF('Hamburg Knights'!B13=\"\",\"\",'Hamburg Knights'!B13)","v":"Rackwitz"},{"$f":"SUM('Hamburg Knights'!D13:D17)","v":6},{"$f":"SUM('Hamburg Knights'!E13:E17)","v":4},{"$f":"SUM('Hamburg Knights'!F13:F17)","v":2},{"$f":"SUM('Hamburg Knights'!G13:G17)","v":0},{"$f":"SUM('Hamburg Knights'!H13:H17)","v":2},{"$f":"SUM('Hamburg Knights'!I13:I17)","v":2},{"$f":"SUM('Hamburg Knights'!J13:J17)","v":0},{"$f":"SUM('Hamburg Knights'!K13:K17)","v":0},{"$f":"SUM('Hamburg Knights'!L13:L17)","v":0},{"$f":"SUM('Hamburg Knights'!M13:M17)","v":2},{"$f":"SUM('Hamburg Knights'!N13:N17)","v":0},{"$f":"SUM('Hamburg Knights'!O13:O17)","v":2},{"$f":"SUM('Hamburg Knights'!P13:P17)","v":0},{"$f":"SUM('Hamburg Knights'!Q13:Q17)","v":0},{"$f":"SUM('Hamburg Knights'!R13:R17)","v":0},null,{"$f":"SUM('Hamburg Knights'!T13:T17)","v":0},{"$f":"SUM('Hamburg Knights'!U13:U17)","v":3},{"$f":"SUM('Hamburg Knights'!V13:V17)","v":1},null,{"$f":"IF(ISERROR(G9/D9),0,G9/D9)","v":0.5},{"$f":"IF(ISERROR((4*J9+3*I9+2*H9+G9-SUM(H9:J9))/D9),0,(4*J9+3*I9+2*H9+G9-SUM(H9:J9))/D9)","v":1},{"$f":"W9+X9","v":1.5},{"$f":"IF(ISERROR((G9+L9+M9)/(D9+L9+M9+Q9)),0,(G9+L9+M9)/(D9+L9+M9+Q9))","v":0.66666666666666663},{"$f":"Z9+X9","v":1.6666666666666665},null,{"$f":"IF(ISERROR((S9+T9)/(U9+S9+T9)),0,(S9+T9)/(U9+S9+T9))","v":0.75}]
[{"$f":"'Hamburg Knights'!A63","v":13},{"$f":"IF('Hamburg Knights'!B63=\"\",\"\",'Hamburg Knights'!B63)","v":"Heiland"},{"$f":"SUM('Hamburg Knights'!D63:D67)","v":4},{"$f":"SUM('Hamburg Knights'!E63:E67)","v":3},{"$f":"SUM('Hamburg Knights'!F63:F67)","v":1},{"$f":"SUM('Hamburg Knights'!G63:G67)","v":2},{"$f":"SUM('Hamburg Knights'!H63:H67)","v":1},{"$f":"SUM('Hamburg Knights'!I63:I67)","v":0},{"$f":"SUM('Hamburg Knights'!J63:J67)","v":1},{"$f":"SUM('Hamburg Knights'!K63:K67)","v":0},{"$f":"SUM('Hamburg Knights'!L63:L67)","v":0},{"$f":"SUM('Hamburg Knights'!M63:M67)","v":0},{"$f":"SUM('Hamburg Knights'!N63:N67)","v":1},{"$f":"SUM('Hamburg Knights'!O63:O67)","v":0},{"$f":"SUM('Hamburg Knights'!P63:P67)","v":0},{"$f":"SUM('Hamburg Knights'!Q63:Q67)","v":0},{"$f":"SUM('Hamburg Knights'!R63:R67)","v":0},null,{"$f":"SUM('Hamburg Knights'!T63:T67)","v":0},{"$f":"SUM('Hamburg Knights'!U63:U67)","v":0},{"$f":"SUM('Hamburg Knights'!V63:V67)","v":1},null,{"$f":"IF(ISERROR(G10/D10),0,G10/D10)","v":0.33333333333333331},{"$f":"IF(ISERROR((4*J10+3*I10+2*H10+G10-SUM(H10:J10))/D10),0,(4*J10+3*I10+2*H10+G10-SUM(H10:J10))/D10)","v":1},{"$f":"W10+X10","v":1.3333333333333333},{"$f":"IF(ISERROR((G10+L10+M10)/(D10+L10+M10+Q10)),0,(G10+L10+M10)/(D10+L10+M10+Q10))","v":0.5},{"$f":"Z10+X10","v":1.5},null,{"$f":"IF(ISERROR((S10+T10)/(U10+S10+T10)),0,(S10+T10)/(U10+S10+T10))","v":0}]
[{"$f":"'Freising Grizzlies'!A18","v":35},{"$f":"IF('Freising Grizzlies'!B18=\"\",\"\",'Freising Grizzlies'!B18)","v":"Sandner"},{"$f":"SUM('Freising Grizzlies'!D18:D22)","v":16},{"$f":"SUM('Freising Grizzlies'!E18:E22)","v":13},{"$f":"SUM('Freising Grizzlies'!F18:F22)","v":12},{"$f":"SUM('Freising Grizzlies'!G18:G22)","v":4},{"$f":"SUM('Freising Grizzlies'!H18:H22)","v":8},{"$f":"SUM('Freising Grizzlies'!I18:I22)","v":1},{"$f":"SUM('Freising Grizzlies'!J18:J22)","v":0},{"$f":"SUM('Freising Grizzlies'!K18:K22)","v":0},{"$f":"SUM('Freising Grizzlies'!L18:L22)","v":1},{"$f":"SUM('Freising Grizzlies'!M18:M22)","v":3},{"$f":"SUM('Freising Grizzlies'!N18:N22)","v":0},{"$f":"SUM('Freising Grizzlies'!O18:O22)","v":2},{"$f":"SUM('Freising Grizzlies'!P18:P22)","v":0},{"$f":"SUM('Freising Grizzlies'!Q18:Q22)","v":0},{"$f":"SUM('Freising Grizzlies'!R18:R22)","v":0},null,{"$f":"SUM('Freising Grizzlies'!T18:T22)","v":7},{"$f":"SUM('Freising Grizzlies'!U18:U22)","v":4},{"$f":"SUM('Freising Grizzlies'!V18:V22)","v":1},null,{"$f":"IF(ISERROR(G11/D11),0,G11/D11)","v":0.61538461538461542},{"$f":"IF(ISERROR((4*J11+3*I11+2*H11+G11-SUM(H11:J11))/D11),0,(4*J11+3*I11+2*H11+G11-SUM(H11:J11))/D11)","v":0.69230769230769229},{"$f":"W11+X11","v":1.3076923076923077},{"$f":"IF(ISERROR((G11+L11+M11)/(D11+L11+M11+Q11)),0,(G11+L11+M11)/(D11+L11+M11+Q11))","v":0.6875},{"$f":"Z11+X11","v":1.3798076923076923},null,{"$f":"IF(ISERROR((S11+T11)/(U11+S11+T11)),0,(S11+T11)/(U11+S11+T11))","v":0.91666666666666663}]
[{"$f":"'Wesseling Vermins'!A18","v":24},{"$f":"IF('Wesseling Vermins'!B18=\"\",\"\",'Wesseling Vermins'!B18)","v":"Dickmeiss"},{"$f":"SUM('Wesseling Vermins'!D18:D22)","v":12},{"$f":"SUM('Wesseling Vermins'!E18:E22)","v":8},{"$f":"SUM('Wesseling Vermins'!F18:F22)","v":7},{"$f":"SUM('Wesseling Vermins'!G18:G22)","v":1},{"$f":"SUM('Wesseling Vermins'!H18:H22)","v":4},{"$f":"SUM('Wesseling Vermins'!I18:I22)","v":2},{"$f":"SUM('Wesseling Vermins'!J18:J22)","v":0},{"$f":"SUM('Wesseling Vermins'!K18:K22)","v":0},{"$f":"SUM('Wesseling Vermins'!L18:L22)","v":0},{"$f":"SUM('Wesseling Vermins'!M18:M22)","v":4},{"$f":"SUM('Wesseling Vermins'!N18:N22)","v":0},{"$f":"SUM('Wesseling Vermins'!O18:O22)","v":5},{"$f":"SUM('Wesseling Vermins'!P18:P22)","v":0},{"$f":"SUM('Wesseling Vermins'!Q18:Q22)","v":0},{"$f":"SUM('Wesseling Vermins'!R18:R22)","v":0},null,{"$f":"SUM('Wesseling Vermins'!T18:T22)","v":3},{"$f":"SUM('Wesseling Vermins'!U18:U22)","v":0},{"$f":"SUM('Wesseling Vermins'!V18:V22)","v":0},null,{"$f":"IF(ISERROR(G12/D12),0,G12/D12)","v":0.5},{"$f":"IF(ISERROR((4*J12+3*I12+2*H12+G12-SUM(H12:J12))/D12),0,(4*J12+3*I12+2*H12+G12-SUM(H12:J12))/D12)","v":0.75},{"$f":"W12+X12","v":1.25},{"$f":"IF(ISERROR((G12+L12+M12)/(D12+L12+M12+Q12)),0,(G12+L12+M12)/(D12+L12+M12+Q12))","v":0.66666666666666663},{"$f":"Z12+X12","v":1.4166666666666665},null,{"$f":"IF(ISERROR((S12+T12)/(U12+S12+T12)),0,(S12+T12)/(U12+S12+T12))","v":1}]
[{"$f":"'Hamburg Knights'!A78","v":16},{"$f":"IF('Hamburg Knights'!B78=\"\",\"\",'Hamburg Knights'!B78)","v":"Ernst"},{"$f":"SUM('Hamburg Knights'!D78:D82)","v":4},{"$f":"SUM('Hamburg Knights'!E78:E82)","v":3},{"$f":"SUM('Hamburg Knights'!F78:F82)","v":2},{"$f":"SUM('Hamburg Knights'!G78:G82)","v":0},{"$f":"SUM('Hamburg Knights'!H78:H82)","v":2},{"$f":"SUM('Hamburg Knights'!I78:I82)","v":0},{"$f":"SUM('Hamburg Knights'!J78:J82)","v":0},{"$f":"SUM('Hamburg Knights'!K78:K82)","v":0},{"$f":"SUM('Hamburg Knights'!L78:L82)","v":0},{"$f":"SUM('Hamburg Knights'!M78:M82)","v":1},{"$f":"SUM('Hamburg Knights'!N78:N82)","v":0},{"$f":"SUM('Hamburg Knights'!O78:O82)","v":0},{"$f":"SUM('Hamburg Knights'!P78:P82)","v":0},{"$f":"SUM('Hamburg Knights'!Q78:Q82)","v":0},{"$f":"SUM('Hamburg Knights'!R78:R82)","v":0},null,{"$f":"SUM('Hamburg Knights'!T78:T82)","v":0},{"$f":"SUM('Hamburg Knights'!U78:U82)","v":0},{"$f":"SUM('Hamburg Knights'!V78:V82)","v":0},null,{"$f":"IF(ISERROR(G13/D13),0,G13/D13)","v":0.66666666666666663},{"$f":"IF(ISERROR((4*J13+3*I13+2*H13+G13-SUM(H13:J13))/D13),0,(4*J13+3*I13+2*H13+G13-SUM(H13:J13))/D13)","v":0.66666666666666663},{"$f":"W13+X13","v":1.3333333333333333},{"$f":"IF(ISERROR((G13+L13+M13)/(D13+L13+M13+Q13)),0,(G13+L13+M13)/(D13+L13+M13+Q13))","v":0.75},{"$f":"Z13+X13","v":1.4166666666666665},null,{"$f":"IF(ISERROR((S13+T13)/(U13+S13+T13)),0,(S13+T13)/(U13+S13+T13))","v":0}]
[{"$f":"'Karlsruhe Cougars'!A13","v":59},{"$f":"IF('Karlsruhe Cougars'!B13=\"\",\"\",'Karlsruhe Cougars'!B13)","v":"Reibenspies"},{"$f":"SUM('Karlsruhe Cougars'!D13:D17)","v":11},{"$f":"SUM('Karlsruhe Cougars'!E13:E17)","v":9},{"$f":"SUM('Karlsruhe Cougars'!F13:F17)","v":3},{"$f":"SUM('Karlsruhe Cougars'!G13:G17)","v":6},{"$f":"SUM('Karlsruhe Cougars'!H13:H17)","v":4},{"$f":"SUM('Karlsruhe Cougars'!I13:I17)","v":3},{"$f":"SUM('Karlsruhe Cougars'!J13:J17)","v":0},{"$f":"SUM('Karlsruhe Cougars'!K13:K17)","v":0},{"$f":"SUM('Karlsruhe Cougars'!L13:L17)","v":1},{"$f":"SUM('Karlsruhe Cougars'!M13:M17)","v":2},{"$f":"SUM('Karlsruhe Cougars'!N13:N17)","v":0},{"$f":"SUM('Karlsruhe Cougars'!O13:O17)","v":2},{"$f":"SUM('Karlsruhe Cougars'!P13:P17)","v":0},{"$f":"SUM('Karlsruhe Cougars'!Q13:Q17)","v":0},{"$f":"SUM('Karlsruhe Cougars'!R13:R17)","v":0},null,{"$f":"SUM('Karlsruhe Cougars'!T13:T17)","v":3},{"$f":"SUM('Karlsruhe Cougars'!U13:U17)","v":3},{"$f":"SUM('Karlsruhe Cougars'!V13:V17)","v":2},null,{"$f":"IF(ISERROR(G14/D14),0,G14/D14)","v":0.44444444444444442},{"$f":"IF(ISERROR((4*J14+3*I14+2*H14+G14-SUM(H14:J14))/D14),0,(4*J14+3*I14+2*H14+G14-SUM(H14:J14))/D14)","v":0.77777777777777779},{"$f":"W14+X14","v":1.2222222222222223},{"$f":"IF(ISERROR((G14+L14+M14)/(D14+L14+M14+Q14)),0,(G14+L14+M14)/(D14+L14+M14+Q14))","v":0.54545454545454541},{"$f":"Z14+X14","v":1.3232323232323231},null,{"$f":"IF(ISERROR((S14+T14)/(U14+S14+T14)),0,(S14+T14)/(U14+S14+T14))","v":0.75}]
[{"$f":"'Freising Grizzlies'!A38","v":39},{"$f":"IF('Freising Grizzlies'!B38=\"\",\"\",'Freising Grizzlies'!B38)","v":"Kerscher"},{"$f":"SUM('Freising Grizzlies'!D38:D42)","v":10},{"$f":"SUM('Freising Grizzlies'!E38:E42)","v":6},{"$f":"SUM('Freising Grizzlies'!F38:F42)","v":3},{"$f":"SUM('Freising Grizzlies'!G38:G42)","v":3},{"$f":"SUM('Freising Grizzlies'!H38:H42)","v":2},{"$f":"SUM('Freising Grizzlies'!I38:I42)","v":1},{"$f":"SUM('Freising Grizzlies'!J38:J42)","v":0},{"$f":"SUM('Freising Grizzlies'!K38:K42)","v":0},{"$f":"SUM('Freising Grizzlies'!L38:L42)","v":1},{"$f":"SUM('Freising Grizzlies'!M38:M42)","v":3},{"$f":"SUM('Freising Grizzlies'!N38:N42)","v":0},{"$f":"SUM('Freising Grizzlies'!O38:O42)","v":0},{"$f":"SUM('Freising Grizzlies'!P38:P42)","v":1},{"$f":"SUM('Freising Grizzlies'!Q38:Q42)","v":0},{"$f":"SUM('Freising Grizzlies'!R38:R42)","v":1},null,{"$f":"SUM('Freising Grizzlies'!T38:T42)","v":1},{"$f":"SUM('Freising Grizzlies'!U38:U42)","v":16},{"$f":"SUM('Freising Grizzlies'!V38:V42)","v":0},null,{"$f":"IF(ISERROR(G15/D15),0,G15/D15)","v":0.33333333333333331},{"$f":"IF(ISERROR((4*J15+3*I15+2*H15+G15-SUM(H15:J15))/D15),0,(4*J15+3*I15+2*H15+G15-SUM(H15:J15))/D15)","v":0.5},{"$f":"W15+X15","v":0.83333333333333326},{"$f":"IF(ISERROR((G15+L15+M15)/(D15+L15+M15+Q15)),0,(G15+L15+M15)/(D15+L15+M15+Q15))","v":0.5},{"$f":"Z15+X15","v":1},null,{"$f":"IF(ISERROR((S15+T15)/(U15+S15+T15)),0,(S15+T15)/(U15+S15+T15))","v":1}]
[{"$f":"'Neunkirchen Nightmares'!A23","v":71},{"$f":"IF('Neunkirchen Nightmares'!B23=\"\",\"\",'Neunkirchen Nightmares'!B23)","v":"Cadsky"},{"$f":"SUM('Neunkirchen Nightmares'!D23:D27)","v":7},{"$f":"SUM('Neunkirchen Nightmares'!E23:E27)","v":3},{"$f":"SUM('Neunkirchen Nightmares'!F23:F27)","v":3},{"$f":"SUM('Neunkirchen Nightmares'!G23:G27)","v":4},{"$f":"SUM('Neunkirchen Nightmares'!H23:H27)","v":2},{"$f":"SUM('Neunkirchen Nightmares'!I23:I27)","v":0},{"$f":"SUM('Neunkirchen Nightmares'!J23:J27)","v":0},{"$f":"SUM('Neunkirchen Nightmares'!K23:K27)","v":0},{"$f":"SUM('Neunkirchen Nightmares'!L23:L27)","v":0},{"$f":"SUM('Neunkirchen Nightmares'!M23:M27)","v":2},{"$f":"SUM('Neunkirchen Nightmares'!N23:N27)","v":0},{"$f":"SUM('Neunkirchen Nightmares'!O23:O27)","v":1},{"$f":"SUM('Neunkirchen Nightmares'!P23:P27)","v":0},{"$f":"SUM('Neunkirchen Nightmares'!Q23:Q27)","v":0},{"$f":"SUM('Neunkirchen Nightmares'!R23:R27)","v":2},null,{"$f":"SUM('Neunkirchen Nightmares'!T23:T27)","v":1},{"$f":"SUM('Neunkirchen Nightmares'!U23:U27)","v":5},{"$f":"SUM('Neunkirchen Nightmares'!V23:V27)","v":0},null,{"$f":"IF(ISERROR(G16/D16),0,G16/D16)","v":0.66666666666666663},{"$f":"IF(ISERROR((4*J16+3*I16+2*H16+G16-SUM(H16:J16))/D16),0,(4*J16+3*I16+2*H16+G16-SUM(H16:J16))/D16)","v":0.66666666666666663},{"$f":"W16+X16","v":1.3333333333333333},{"$f":"IF(ISERROR((G16+L16+M16)/(D16+L16+M16+Q16)),0,(G16+L16+M16)/(D16+L16+M16+Q16))","v":0.5714285714285714},{"$f":"Z16+X16","v":1.2380952380952381},null,{"$f":"IF(ISERROR((S16+T16)/(U16+S16+T16)),0,(S16+T16)/(U16+S16+T16))","v":1}]
[{"$f":"'Freising Grizzlies'!A48","v":41},{"$f":"IF('Freising Grizzlies'!B48=\"\",\"\",'Freising Grizzlies'!B48)","v":"Thürmer"},{"$f":"SUM('Freising Grizzlies'!D48:D52)","v":13},{"$f":"SUM('Freising Grizzlies'!E48:E52)","v":13},{"$f":"SUM('Freising Grizzlies'!F48:F52)","v":6},{"$f":"SUM('Freising Grizzlies'!G48:G52)","v":3},{"$f":"SUM('Freising Grizzlies'!H48:H52)","v":5},{"$f":"SUM('Freising Grizzlies'!I48:I52)","v":0},{"$f":"SUM('Freising Grizzlies'!J48:J52)","v":1},{"$f":"SUM('Freising Grizzlies'!K48:K52)","v":0},{"$f":"SUM('Freising Grizzlies'!L48:L52)","v":2},{"$f":"SUM('Freising Grizzlies'!M48:M52)","v":0},{"$f":"SUM('Freising Grizzlies'!N48:N52)","v":0},{"$f":"SUM('Freising Grizzlies'!O48:O52)","v":0},{"$f":"SUM('Freising Grizzlies'!P48:P52)","v":0},{"$f":"SUM('Freising Grizzlies'!Q48:Q52)","v":0},{"$f":"SUM('Freising Grizzlies'!R48:R52)","v":0},null,{"$f":"SUM('Freising Grizzlies'!T48:T52)","v":8},{"$f":"SUM('Freising Grizzlies'!U48:U52)","v":5},{"$f":"SUM('Freising Grizzlies'!V48:V52)","v":0},null,{"$f":"IF(ISERROR(G17/D17),0,G17/D17)","v":0.38461538461538464},{"$f":"IF(ISERROR((4*J17+3*I17+2*H17+G17-SUM(H17:J17))/D17),0,(4*J17+3*I17+2*H17+G17-SUM(H17:J17))/D17)","v":0.53846153846153844},{"$f":"W17+X17","v":0.92307692307692313},{"$f":"IF(ISERROR((G17+L17+M17)/(D17+L17+M17+Q17)),0,(G17+L17+M17)/(D17+L17+M17+Q17))","v":0.38461538461538464},{"$f":"Z17+X17","v":0.92307692307692313},null,{"$f":"IF(ISERROR((S17+T17)/(U17+S17+T17)),0,(S17+T17)/(U17+S17+T17))","v":1}]
[{"$f":"'Haar Disciples'!A43","v":51},{"$f":"IF('Haar Disciples'!B43=\"\",\"\",'Haar Disciples'!B43)","v":"Ruziourouh"},{"$f":"SUM('Haar Disciples'!D43:D47)","v":16},{"$f":"SUM('Haar Disciples'!E43:E47)","v":14},{"$f":"SUM('Haar Disciples'!F43:F47)","v":5},{"$f":"SUM('Haar Disciples'!G43:G47)","v":4},{"$f":"SUM('Haar Disciples'!H43:H47)","v":5},{"$f":"SUM('Haar Disciples'!I43:I47)","v":1},{"$f":"SUM('Haar Disciples'!J43:J47)","v":0},{"$f":"SUM('Haar Disciples'!K43:K47)","v":0},{"$f":"SUM('Haar Disciples'!L43:L47)","v":0},{"$f":"SUM('Haar Disciples'!M43:M47)","v":2},{"$f":"SUM('Haar Disciples'!N43:N47)","v":0},{"$f":"SUM('Haar Disciples'!O43:O47)","v":0},{"$f":"SUM('Haar Disciples'!P43:P47)","v":0},{"$f":"SUM('Haar Disciples'!Q43:Q47)","v":0},{"$f":"SUM('Haar Disciples'!R43:R47)","v":0},null,{"$f":"SUM('Haar Disciples'!T43:T47)","v":2},{"$f":"SUM('Haar Disciples'!U43:U47)","v":0},{"$f":"SUM('Haar Disciples'!V43:V47)","v":0},null,{"$f":"IF(ISERROR(G18/D18),0,G18/D18)","v":0.35714285714285715},{"$f":"IF(ISERROR((4*J18+3*I18+2*H18+G18-SUM(H18:J18))/D18),0,(4*J18+3*I18+2*H18+G18-SUM(H18:J18))/D18)","v":0.42857142857142855},{"$f":"W18+X18","v":0.7857142857142857},{"$f":"IF(ISERROR((G18+L18+M18)/(D18+L18+M18+Q18)),0,(G18+L18+M18)/(D18+L18+M18+Q18))","v":0.4375},{"$f":"Z18+X18","v":0.8660714285714286},null,{"$f":"IF(ISERROR((S18+T18)/(U18+S18+T18)),0,(S18+T18)/(U18+S18+T18))","v":1}]
[{"$f":"'Haar Disciples'!A3","v":43},{"$f":"IF('Haar Disciples'!B3=\"\",\"\",'Haar Disciples'!B3)","v":"Stepniak"},{"$f":"SUM('Haar Disciples'!D3:D7)","v":18},{"$f":"SUM('Haar Disciples'!E3:E7)","v":15},{"$f":"SUM('Haar Disciples'!F3:F7)","v":8},{"$f":"SUM('Haar Disciples'!G3:G7)","v":1},{"$f":"SUM('Haar Disciples'!H3:H7)","v":6},{"$f":"SUM('Haar Disciples'!I3:I7)","v":0},{"$f":"SUM('Haar Disciples'!J3:J7)","v":2},{"$f":"SUM('Haar Disciples'!K3:K7)","v":0},{"$f":"SUM('Haar Disciples'!L3:L7)","v":1},{"$f":"SUM('Haar Disciples'!M3:M7)","v":2},{"$f":"SUM('Haar Disciples'!N3:N7)","v":1},{"$f":"SUM('Haar Disciples'!O3:O7)","v":3},{"$f":"SUM('Haar Disciples'!P3:P7)","v":0},{"$f":"SUM('Haar Disciples'!Q3:Q7)","v":0},{"$f":"SUM('Haar Disciples'!R3:R7)","v":0},null,{"$f":"SUM('Haar Disciples'!T3:T7)","v":13},{"$f":"SUM('Haar Disciples'!U3:U7)","v":7},{"$f":"SUM('Haar Disciples'!V3:V7)","v":1},null,{"$f":"IF(ISERROR(G19/D19),0,G19/D19)","v":0.4},{"$f":"IF(ISERROR((4*J19+3*I19+2*H19+G19-SUM(H19:J19))/D19),0,(4*J19+3*I19+2*H19+G19-SUM(H19:J19))/D19)","v":0.66666666666666663},{"$f":"W19+X19","v":1.0666666666666667},{"$f":"IF(ISERROR((G19+L19+M19)/(D19+L19+M19+Q19)),0,(G19+L19+M19)/(D19+L19+M19+Q19))","v":0.5},{"$f":"Z19+X19","v":1.1666666666666665},null,{"$f":"IF(ISERROR((S19+T19)/(U19+S19+T19)),0,(S19+T19)/(U19+S19+T19))","v":0.95238095238095233}]
[{"$f":"'Hamburg Knights'!A68","v":14},{"$f":"IF('Hamburg Knights'!B68=\"\",\"\",'Hamburg Knights'!B68)","v":"Siering"},{"$f":"SUM('Hamburg Knights'!D68:D72)","v":6},{"$f":"SUM('Hamburg Knights'!E68:E72)","v":4},{"$f":"SUM('Hamburg Knights'!F68:F72)","v":2},{"$f":"SUM('Hamburg Knights'!G68:G72)","v":0},{"$f":"SUM('Hamburg Knights'!H68:H72)","v":2},{"$f":"SUM('Hamburg Knights'!I68:I72)","v":0},{"$f":"SUM('Hamburg Knights'!J68:J72)","v":0},{"$f":"SUM('Hamburg Knights'!K68:K72)","v":0},{"$f":"SUM('Hamburg Knights'!L68:L72)","v":1},{"$f":"SUM('Hamburg Knights'!M68:M72)","v":2},{"$f":"SUM('Hamburg Knights'!N68:N72)","v":0},{"$f":"SUM('Hamburg Knights'!O68:O72)","v":1},{"$f":"SUM('Hamburg Knights'!P68:P72)","v":1},{"$f":"SUM('Hamburg Knights'!Q68:Q72)","v":0},{"$f":"SUM('Hamburg Knights'!R68:R72)","v":0},null,{"$f":"SUM('Hamburg Knights'!T68:T72)","v":2},{"$f":"SUM('Hamburg Knights'!U68:U72)","v":4},{"$f":"SUM('Hamburg Knights'!V68:V72)","v":1},null,{"$f":"IF(ISERROR(G20/D20),0,G20/D20)","v":0.5},{"$f":"IF(ISERROR((4*J20+3*I20+2*H20+G20-SUM(H20:J20))/D20),0,(4*J20+3*I20+2*H20+G20-SUM(H20:J20))/D20)","v":0.5},{"$f":"W20+X20","v":1},{"$f":"IF(ISERROR((G20+L20+M20)/(D20+L20+M20+Q20)),0,(G20+L20+M20)/(D20+L20+M20+Q20))","v":0.66666666666666663},{"$f":"Z20+X20","v":1.1666666666666665},null,{"$f":"IF(ISERROR((S20+T20)/(U20+S20+T20)),0,(S20+T20)/(U20+S20+T20))","v":0.8571428571428571}]
[{"$f":"'Haar Disciples'!A18","v":46},{"$f":"IF('Haar Disciples'!B18=\"\",\"\",'Haar Disciples'!B18)","v":"Reinisch, Kat"},{"$f":"SUM('Haar Disciples'!D18:D22)","v":13},{"$f":"SUM('Haar Disciples'!E18:E22)","v":9},{"$f":"SUM('Haar Disciples'!F18:F22)","v":2},{"$f":"SUM('Haar Disciples'!G18:G22)","v":3},{"$f":"SUM('Haar Disciples'!H18:H22)","v":3},{"$f":"SUM('Haar Disciples'!I18:I22)","v":2},{"$f":"SUM('Haar Disciples'!J18:J22)","v":0},{"$f":"SUM('Haar Disciples'!K18:K22)","v":0},{"$f":"SUM('Haar Disciples'!L18:L22)","v":3},{"$f":"SUM('Haar Disciples'!M18:M22)","v":4},{"$f":"SUM('Haar Disciples'!N18:N22)","v":0},{"$f":"SUM('Haar Disciples'!O18:O22)","v":0},{"$f":"SUM('Haar Disciples'!P18:P22)","v":0},{"$f":"SUM('Haar Disciples'!Q18:Q22)","v":0},{"$f":"SUM('Haar Disciples'!R18:R22)","v":0},null,{"$f":"SUM('Haar Disciples'!T18:T22)","v":8},{"$f":"SUM('Haar Disciples'!U18:U22)","v":14},{"$f":"SUM('Haar Disciples'!V18:V22)","v":1},null,{"$f":"IF(ISERROR(G21/D21),0,G21/D21)","v":0.33333333333333331},{"$f":"IF(ISERROR((4*J21+3*I21+2*H21+G21-SUM(H21:J21))/D21),0,(4*J21+3*I21+2*H21+G21-SUM(H21:J21))/D21)","v":0.55555555555555558},{"$f":"W21+X21","v":0.88888888888888884},{"$f":"IF(ISERROR((G21+L21+M21)/(D21+L21+M21+Q21)),0,(G21+L21+M21)/(D21+L21+M21+Q21))","v":0.53846153846153844},{"$f":"Z21+X21","v":1.0940170940170941},null,{"$f":"IF(ISERROR((S21+T21)/(U21+S21+T21)),0,(S21+T21)/(U21+S21+T21))","v":0.95652173913043481}]
[{"$f":"'Freising Grizzlies'!A28","v":37},{"$f":"IF('Freising Grizzlies'!B28=\"\",\"\",'Freising Grizzlies'!B28)","v":"Steffen"},{"$f":"SUM('Freising Grizzlies'!D28:D32)","v":16},{"$f":"SUM('Freising Grizzlies'!E28:E32)","v":10},{"$f":"SUM('Freising Grizzlies'!F28:F32)","v":8},{"$f":"SUM('Freising Grizzlies'!G28:G32)","v":5},{"$f":"SUM('Freising Grizzlies'!H28:H32)","v":4},{"$f":"SUM('Freising Grizzlies'!I28:I32)","v":2},{"$f":"SUM('Freising Grizzlies'!J28:J32)","v":0},{"$f":"SUM('Freising Grizzlies'!K28:K32)","v":0},{"$f":"SUM('Freising Grizzlies'!L28:L32)","v":0},{"$f":"SUM('Freising Grizzlies'!M28:M32)","v":4},{"$f":"SUM('Freising Grizzlies'!N28:N32)","v":1},{"$f":"SUM('Freising Grizzlies'!O28:O32)","v":1},{"$f":"SUM('Freising Grizzlies'!P28:P32)","v":0},{"$f":"SUM('Freising Grizzlies'!Q28:Q32)","v":1},{"$f":"SUM('Freising Grizzlies'!R28:R32)","v":0},null,{"$f":"SUM('Freising Grizzlies'!T28:T32)","v":8},{"$f":"SUM('Freising Grizzlies'!U28:U32)","v":4},{"$f":"SUM('Freising Grizzlies'!V28:V32)","v":0},null,{"$f":"IF(ISERROR(G22/D22),0,G22/D22)","v":0.4},{"$f":"IF(ISERROR((4*J22+3*I22+2*H22+G22-SUM(H22:J22))/D22),0,(4*J22+3*I22+2*H22+G22-SUM(H22:J22))/D22)","v":0.6},{"$f":"W22+X22","v":1},{"$f":"IF(ISERROR((G22+L22+M22)/(D22+L22+M22+Q22)),0,(G22+L22+M22)/(D22+L22+M22+Q22))","v":0.6},{"$f":"Z22+X22","v":1.2},null,{"$f":"IF(ISERROR((S22+T22)/(U22+S22+T22)),0,(S22+T22)/(U22+S22+T22))","v":1}]
[{"$f":"'Freising Grizzlies'!A3","v":32},{"$f":"IF('Freising Grizzlies'!B3=\"\",\"\",'Freising Grizzlies'!B3)","v":"Biswas, T."},{"$f":"SUM('Freising Grizzlies'!D3:D7)","v":13},{"$f":"SUM('Freising Grizzlies'!E3:E7)","v":9},{"$f":"SUM('Freising Grizzlies'!F3:F7)","v":4},{"$f":"SUM('Freising Grizzlies'!G3:G7)","v":3},{"$f":"SUM('Freising Grizzlies'!H3:H7)","v":2},{"$f":"SUM('Freising Grizzlies'!I3:I7)","v":2},{"$f":"SUM('Freising Grizzlies'!J3:J7)","v":0},{"$f":"SUM('Freising Grizzlies'!K3:K7)","v":0},{"$f":"SUM('Freising Grizzlies'!L3:L7)","v":2},{"$f":"SUM('Freising Grizzlies'!M3:M7)","v":4},{"$f":"SUM('Freising Grizzlies'!N3:N7)","v":0},{"$f":"SUM('Freising Grizzlies'!O3:O7)","v":1},{"$f":"SUM('Freising Grizzlies'!P3:P7)","v":0},{"$f":"SUM('Freising Grizzlies'!Q3:Q7)","v":0},{"$f":"SUM('Freising Grizzlies'!R3:R7)","v":0},null,{"$f":"SUM('Freising Grizzlies'!T3:T7)","v":2},{"$f":"SUM('Freising Grizzlies'!U3:U7)","v":4},{"$f":"SUM('Freising Grizzlies'!V3:V7)","v":2},null,{"$f":"IF(ISERROR(G23/D23),0,G23/D23)","v":0.22222222222222221},{"$f":"IF(ISERROR((4*J23+3*I23+2*H23+G23-SUM(H23:J23))/D23),0,(4*J23+3*I23+2*H23+G23-SUM(H23:J23))/D23)","v":0.44444444444444442},{"$f":"W23+X23","v":0.66666666666666663},{"$f":"IF(ISERROR((G23+L23+M23)/(D23+L23+M23+Q23)),0,(G23+L23+M23)/(D23+L23+M23+Q23))","v":0.46153846153846156},{"$f":"Z23+X23","v":0.90598290598290598},null,{"$f":"IF(ISERROR((S23+T23)/(U23+S23+T23)),0,(S23+T23)/(U23+S23+T23))","v":0.75}]
[{"$f":"'Karlsruhe Cougars'!A33","v":63},{"$f":"IF('Karlsruhe Cougars'!B33=\"\",\"\",'Karlsruhe Cougars'!B33)","v":"Kortenkamp"},{"$f":"SUM('Karlsruhe Cougars'!D33:D37)","v":10},{"$f":"SUM('Karlsruhe Cougars'!E33:E37)","v":8},{"$f":"SUM('Karlsruhe Cougars'!F33:F37)","v":1},{"$f":"SUM('Karlsruhe Cougars'!G33:G37)","v":4},{"$f":"SUM('Karlsruhe Cougars'!H33:H37)","v":4},{"$f":"SUM('Karlsruhe Cougars'!I33:I37)","v":0},{"$f":"SUM('Karlsruhe Cougars'!J33:J37)","v":0},{"$f":"SUM('Karlsruhe Cougars'!K33:K37)","v":0},{"$f":"SUM('Karlsruhe Cougars'!L33:L37)","v":1},{"$f":"SUM('Karlsruhe Cougars'!M33:M37)","v":0},{"$f":"SUM('Karlsruhe Cougars'!N33:N37)","v":1},{"$f":"SUM('Karlsruhe Cougars'!O33:O37)","v":2},{"$f":"SUM('Karlsruhe Cougars'!P33:P37)","v":0},{"$f":"SUM('Karlsruhe Cougars'!Q33:Q37)","v":0},{"$f":"SUM('Karlsruhe Cougars'!R33:R37)","v":1},null,{"$f":"SUM('Karlsruhe Cougars'!T33:T37)","v":2},{"$f":"SUM('Karlsruhe Cougars'!U33:U37)","v":4},{"$f":"SUM('Karlsruhe Cougars'!V33:V37)","v":1},null,{"$f":"IF(ISERROR(G24/D24),0,G24/D24)","v":0.5},{"$f":"IF(ISERROR((4*J24+3*I24+2*H24+G24-SUM(H24:J24))/D24),0,(4*J24+3*I24+2*H24+G24-SUM(H24:J24))/D24)","v":0.5},{"$f":"W24+X24","v":1},{"$f":"IF(ISERROR((G24+L24+M24)/(D24+L24+M24+Q24)),0,(G24+L24+M24)/(D24+L24+M24+Q24))","v":0.5},{"$f":"Z24+X24","v":1},null,{"$f":"IF(ISERROR((S24+T24)/(U24+S24+T24)),0,(S24+T24)/(U24+S24+T24))","v":0.8571428571428571}]
[{"$f":"'Wesseling Vermins'!A48","v":30},{"$f":"IF('Wesseling Vermins'!B48=\"\",\"\",'Wesseling Vermins'!B48)","v":"Seiden"},{"$f":"SUM('Wesseling Vermins'!D48:D52)","v":1},{"$f":"SUM('Wesseling Vermins'!E48:E52)","v":0},{"$f":"SUM('Wesseling Vermins'!F48:F52)","v":1},{"$f":"SUM('Wesseling Vermins'!G48:G52)","v":0},{"$f":"SUM('Wesseling Vermins'!H48:H52)","v":0},{"$f":"SUM('Wesseling Vermins'!I48:I52)","v":0},{"$f":"SUM('Wesseling Vermins'!J48:J52)","v":0},{"$f":"SUM('Wesseling Vermins'!K48:K52)","v":0},{"$f":"SUM('Wesseling Vermins'!L48:L52)","v":0},{"$f":"SUM('Wesseling Vermins'!M48:M52)","v":0},{"$f":"SUM('Wesseling Vermins'!N48:N52)","v":1},{"$f":"SUM('Wesseling Vermins'!O48:O52)","v":0},{"$f":"SUM('Wesseling Vermins'!P48:P52)","v":0},{"$f":"SUM('Wesseling Vermins'!Q48:Q52)","v":0},{"$f":"SUM('Wesseling Vermins'!R48:R52)","v":0},null,{"$f":"SUM('Wesseling Vermins'!T48:T52)","v":0},{"$f":"SUM('Wesseling Vermins'!U48:U52)","v":1},{"$f":"SUM('Wesseling Vermins'!V48:V52)","v":0},null,{"$f":"IF(ISERROR(G25/D25),0,G25/D25)","v":0},{"$f":"IF(ISERROR((4*J25+3*I25+2*H25+G25-SUM(H25:J25))/D25),0,(4*J25+3*I25+2*H25+G25-SUM(H25:J25))/D25)","v":0},{"$f":"W25+X25","v":0},{"$f":"IF(ISERROR((G25+L25+M25)/(D25+L25+M25+Q25)),0,(G25+L25+M25)/(D25+L25+M25+Q25))","v":1},{"$f":"Z25+X25","v":1},null,{"$f":"IF(ISERROR((S25+T25)/(U25+S25+T25)),0,(S25+T25)/(U25+S25+T25))","v":1}]
[{"$f":"'Haar Disciples'!A48","v":52},{"$f":"IF('Haar Disciples'!B48=\"\",\"\",'Haar Disciples'!B48)","v":"Huber"},{"$f":"SUM('Haar Disciples'!D48:D52)","v":1},{"$f":"SUM('Haar Disciples'!E48:E52)","v":0},{"$f":"SUM('Haar Disciples'!F48:F52)","v":2},{"$f":"SUM('Haar Disciples'!G48:G52)","v":0},{"$f":"SUM('Haar Disciples'!H48:H52)","v":0},{"$f":"SUM('Haar Disciples'!I48:I52)","v":0},{"$f":"SUM('Haar Disciples'!J48:J52)","v":0},{"$f":"SUM('Haar Disciples'!K48:K52)","v":0},{"$f":"SUM('Haar Disciples'!L48:L52)","v":0},{"$f":"SUM('Haar Disciples'!M48:M52)","v":1},{"$f":"SUM('Haar Disciples'!N48:N52)","v":0},{"$f":"SUM('Haar Disciples'!O48:O52)","v":0},{"$f":"SUM('Haar Disciples'!P48:P52)","v":0},{"$f":"SUM('Haar Disciples'!Q48:Q52)","v":0},{"$f":"SUM('Haar Disciples'!R48:R52)","v":0},null,{"$f":"SUM('Haar Disciples'!T48:T52)","v":6},{"$f":"SUM('Haar Disciples'!U48:U52)","v":5},{"$f":"SUM('Haar Disciples'!V48:V52)","v":2},null,{"$f":"IF(ISERROR(G26/D26),0,G26/D26)","v":0},{"$f":"IF(ISERROR((4*J26+3*I26+2*H26+G26-SUM(H26:J26))/D26),0,(4*J26+3*I26+2*H26+G26-SUM(H26:J26))/D26)","v":0},{"$f":"W26+X26","v":0},{"$f":"IF(ISERROR((G26+L26+M26)/(D26+L26+M26+Q26)),0,(G26+L26+M26)/(D26+L26+M26+Q26))","v":1},{"$f":"Z26+X26","v":1},null,{"$f":"IF(ISERROR((S26+T26)/(U26+S26+T26)),0,(S26+T26)/(U26+S26+T26))","v":0.84615384615384615}]
[{"$f":"'Haar Disciples'!A33","v":49},{"$f":"IF('Haar Disciples'!B33=\"\",\"\",'Haar Disciples'!B33)","v":"Marric"},{"$f":"SUM('Haar Disciples'!D33:D37)","v":13},{"$f":"SUM('Haar Disciples'!E33:E37)","v":11},{"$f":"SUM('Haar Disciples'!F33:F37)","v":5},{"$f":"SUM('Haar Disciples'!G33:G37)","v":1},{"$f":"SUM('Haar Disciples'!H33:H37)","v":5},{"$f":"SUM('Haar Disciples'!I33:I37)","v":0},{"$f":"SUM('Haar Disciples'!J33:J37)","v":0},{"$f":"SUM('Haar Disciples'!K33:K37)","v":0},{"$f":"SUM('Haar Disciples'!L33:L37)","v":1},{"$f":"SUM('Haar Disciples'!M33:M37)","v":1},{"$f":"SUM('Haar Disciples'!N33:N37)","v":0},{"$f":"SUM('Haar Disciples'!O33:O37)","v":0},{"$f":"SUM('Haar Disciples'!P33:P37)","v":0},{"$f":"SUM('Haar Disciples'!Q33:Q37)","v":0},{"$f":"SUM('Haar Disciples'!R33:R37)","v":0},null,{"$f":"SUM('Haar Disciples'!T33:T37)","v":1},{"$f":"SUM('Haar Disciples'!U33:U37)","v":1},{"$f":"SUM('Haar Disciples'!V33:V37)","v":0},null,{"$f":"IF(ISERROR(G27/D27),0,G27/D27)","v":0.45454545454545453},{"$f":"IF(ISERROR((4*J27+3*I27+2*H27+G27-SUM(H27:J27))/D27),0,(4*J27+3*I27+2*H27+G27-SUM(H27:J27))/D27)","v":0.45454545454545453},{"$f":"W27+X27","v":0.90909090909090906},{"$f":"IF(ISERROR((G27+L27+M27)/(D27+L27+M27+Q27)),0,(G27+L27+M27)/(D27+L27+M27+Q27))","v":0.5},{"$f":"Z27+X27","v":0.95454545454545459},null,{"$f":"IF(ISERROR((S27+T27)/(U27+S27+T27)),0,(S27+T27)/(U27+S27+T27))","v":1}]
[{"$f":"'Wesseling Vermins'!A23","v":25},{"$f":"IF('Wesseling Vermins'!B23=\"\",\"\",'Wesseling Vermins'!B23)","v":"Thies"},{"$f":"SUM('Wesseling Vermins'!D23:D27)","v":12},{"$f":"SUM('Wesseling Vermins'!E23:E27)","v":8},{"$f":"SUM('Wesseling Vermins'!F23:F27)","v":4},{"$f":"SUM('Wesseling Vermins'!G23:G27)","v":1},{"$f":"SUM('Wesseling Vermins'!H23:H27)","v":2},{"$f":"SUM('Wesseling Vermins'!I23:I27)","v":1},{"$f":"SUM('Wesseling Vermins'!J23:J27)","v":0},{"$f":"SUM('Wesseling Vermins'!K23:K27)","v":0},{"$f":"SUM('Wesseling Vermins'!L23:L27)","v":4},{"$f":"SUM('Wesseling Vermins'!M23:M27)","v":4},{"$f":"SUM('Wesseling Vermins'!N23:N27)","v":0},{"$f":"SUM('Wesseling Vermins'!O23:O27)","v":0},{"$f":"SUM('Wesseling Vermins'!P23:P27)","v":0},{"$f":"SUM('Wesseling Vermins'!Q23:Q27)","v":0},{"$f":"SUM('Wesseling Vermins'!R23:R27)","v":0},null,{"$f":"SUM('Wesseling Vermins'!T23:T27)","v":1},{"$f":"SUM('Wesseling Vermins'!U23:U27)","v":2},{"$f":"SUM('Wesseling Vermins'!V23:V27)","v":0},null,{"$f":"IF(ISERROR(G28/D28),0,G28/D28)","v":0.25},{"$f":"IF(ISERROR((4*J28+3*I28+2*H28+G28-SUM(H28:J28))/D28),0,(4*J28+3*I28+2*H28+G28-SUM(H28:J28))/D28)","v":0.375},{"$f":"W28+X28","v":0.625},{"$f":"IF(ISERROR((G28+L28+M28)/(D28+L28+M28+Q28)),0,(G28+L28+M28)/(D28+L28+M28+Q28))","v":0.5},{"$f":"Z28+X28","v":0.875},null,{"$f":"IF(ISERROR((S28+T28)/(U28+S28+T28)),0,(S28+T28)/(U28+S28+T28))","v":1}]
[{"$f":"'Karlsruhe Cougars'!A18","v":60},{"$f":"IF('Karlsruhe Cougars'!B18=\"\",\"\",'Karlsruhe Cougars'!B18)","v":"Apel"},{"$f":"SUM('Karlsruhe Cougars'!D18:D22)","v":11},{"$f":"SUM('Karlsruhe Cougars'!E18:E22)","v":5},{"$f":"SUM('Karlsruhe Cougars'!F18:F22)","v":3},{"$f":"SUM('Karlsruhe Cougars'!G18:G22)","v":1},{"$f":"SUM('Karlsruhe Cougars'!H18:H22)","v":1},{"$f":"SUM('Karlsruhe Cougars'!I18:I22)","v":0},{"$f":"SUM('Karlsruhe Cougars'!J18:J22)","v":0},{"$f":"SUM('Karlsruhe Cougars'!K18:K22)","v":0},{"$f":"SUM('Karlsruhe Cougars'!L18:L22)","v":0},{"$f":"SUM('Karlsruhe Cougars'!M18:M22)","v":5},{"$f":"SUM('Karlsruhe Cougars'!N18:N22)","v":1},{"$f":"SUM('Karlsruhe Cougars'!O18:O22)","v":3},{"$f":"SUM('Karlsruhe Cougars'!P18:P22)","v":0},{"$f":"SUM('Karlsruhe Cougars'!Q18:Q22)","v":0},{"$f":"SUM('Karlsruhe Cougars'!R18:R22)","v":0},null,{"$f":"SUM('Karlsruhe Cougars'!T18:T22)","v":1},{"$f":"SUM('Karlsruhe Cougars'!U18:U22)","v":9},{"$f":"SUM('Karlsruhe Cougars'!V18:V22)","v":5},null,{"$f":"IF(ISERROR(G29/D29),0,G29/D29)","v":0.2},{"$f":"IF(ISERROR((4*J29+3*I29+2*H29+G29-SUM(H29:J29))/D29),0,(4*J29+3*I29+2*H29+G29-SUM(H29:J29))/D29)","v":0.2},{"$f":"W29+X29","v":0.4},{"$f":"IF(ISERROR((G29+L29+M29)/(D29+L29+M29+Q29)),0,(G29+L29+M29)/(D29+L29+M29+Q29))","v":0.63636363636363635},{"$f":"Z29+X29","v":0.83636363636363642},null,{"$f":"IF(ISERROR((S29+T29)/(U29+S29+T29)),0,(S29+T29)/(U29+S29+T29))","v":0.66666666666666663}]
[{"$f":"'Neunkirchen Nightmares'!A43","v":75},{"$f":"IF('Neunkirchen Nightmares'!B43=\"\",\"\",'Neunkirchen Nightmares'!B43)","v":"Pietrzyt"},{"$f":"SUM('Neunkirchen Nightmares'!D43:D47)","v":8},{"$f":"SUM('Neunkirchen Nightmares'!E43:E47)","v":6},{"$f":"SUM('Neunkirchen Nightmares'!F43:F47)","v":1},{"$f":"SUM('Neunkirchen Nightmares'!G43:G47)","v":1},{"$f":"SUM('Neunkirchen Nightmares'!H43:H47)","v":2},{"$f":"SUM('Neunkirchen Nightmares'!I43:I47)","v":0},{"$f":"SUM('Neunkirchen Nightmares'!J43:J47)","v":0},{"$f":"SUM('Neunkirchen Nightmares'!K43:K47)","v":0},{"$f":"SUM('Neunkirchen Nightmares'!L43:L47)","v":1},{"$f":"SUM('Neunkirchen Nightmares'!M43:M47)","v":2},{"$f":"SUM('Neunkirchen Nightmares'!N43:N47)","v":0},{"$f":"SUM('Neunkirchen Nightmares'!O43:O47)","v":0},{"$f":"SUM('Neunkirchen Nightmares'!P43:P47)","v":0},{"$f":"SUM('Neunkirchen Nightmares'!Q43:Q47)","v":0},{"$f":"SUM('Neunkirchen Nightmares'!R43:R47)","v":0},null,{"$f":"SUM('Neunkirchen Nightmares'!T43:T47)","v":1},{"$f":"SUM('Neunkirchen Nightmares'!U43:U47)","v":1},{"$f":"SUM('Neunkirchen Nightmares'!V43:V47)","v":2},null,{"$f":"IF(ISERROR(G30/D30),0,G30/D30)","v":0.33333333333333331},{"$f":"IF(ISERROR((4*J30+3*I30+2*H30+G30-SUM(H30:J30))/D30),0,(4*J30+3*I30+2*H30+G30-SUM(H30:J30))/D30)","v":0.33333333333333331},{"$f":"W30+X30","v":0.66666666666666663},{"$f":"IF(ISERROR((G30+L30+M30)/(D30+L30+M30+Q30)),0,(G30+L30+M30)/(D30+L30+M30+Q30))","v":0.5},{"$f":"Z30+X30","v":0.83333333333333326},null,{"$f":"IF(ISERROR((S30+T30)/(U30+S30+T30)),0,(S30+T30)/(U30+S30+T30))","v":0.5}]
[{"$f":"'Wesseling Vermins'!A3","v":21},{"$f":"IF('Wesseling Vermins'!B3=\"\",\"\",'Wesseling Vermins'!B3)","v":"Dunford"},{"$f":"SUM('Wesseling Vermins'!D3:D7)","v":13},{"$f":"SUM('Wesseling Vermins'!E3:E7)","v":7},{"$f":"SUM('Wesseling Vermins'!F3:F7)","v":6},{"$f":"SUM('Wesseling Vermins'!G3:G7)","v":3},{"$f":"SUM('Wesseling Vermins'!H3:H7)","v":1},{"$f":"SUM('Wesseling Vermins'!I3:I7)","v":1},{"$f":"SUM('Wesseling Vermins'!J3:J7)","v":0},{"$f":"SUM('Wesseling Vermins'!K3:K7)","v":0},{"$f":"SUM('Wesseling Vermins'!L3:L7)","v":1},{"$f":"SUM('Wesseling Vermins'!M3:M7)","v":6},{"$f":"SUM('Wesseling Vermins'!N3:N7)","v":0},{"$f":"SUM('Wesseling Vermins'!O3:O7)","v":2},{"$f":"SUM('Wesseling Vermins'!P3:P7)","v":0},{"$f":"SUM('Wesseling Vermins'!Q3:Q7)","v":0},{"$f":"SUM('Wesseling Vermins'!R3:R7)","v":0},null,{"$f":"SUM('Wesseling Vermins'!T3:T7)","v":2},{"$f":"SUM('Wesseling Vermins'!U3:U7)","v":30},{"$f":"SUM('Wesseling Vermins'!V3:V7)","v":0},null,{"$f":"IF(ISERROR(G31/D31),0,G31/D31)","v":0.14285714285714285},{"$f":"IF(ISERROR((4*J31+3*I31+2*H31+G31-SUM(H31:J31))/D31),0,(4*J31+3*I31+2*H31+G31-SUM(H31:J31))/D31)","v":0.2857142857142857},{"$f":"W31+X31","v":0.42857142857142855},{"$f":"IF(ISERROR((G31+L31+M31)/(D31+L31+M31+Q31)),0,(G31+L31+M31)/(D31+L31+M31+Q31))","v":0.53846153846153844},{"$f":"Z31+X31","v":0.82417582417582413},null,{"$f":"IF(ISERROR((S31+T31)/(U31+S31+T31)),0,(S31+T31)/(U31+S31+T31))","v":1}]
[{"$f":"'Haar Disciples'!A13","v":45},{"$f":"IF('Haar Disciples'!B13=\"\",\"\",'Haar Disciples'!B13)","v":"Laack"},{"$f":"SUM('Haar Disciples'!D13:D17)","v":17},{"$f":"SUM('Haar Disciples'!E13:E17)","v":16},{"$f":"SUM('Haar Disciples'!F13:F17)","v":4},{"$f":"SUM('Haar Disciples'!G13:G17)","v":2},{"$f":"SUM('Haar Disciples'!H13:H17)","v":4},{"$f":"SUM('Haar Disciples'!I13:I17)","v":0},{"$f":"SUM('Haar Disciples'!J13:J17)","v":1},{"$f":"SUM('Haar Disciples'!K13:K17)","v":0},{"$f":"SUM('Haar Disciples'!L13:L17)","v":4},{"$f":"SUM('Haar Disciples'!M13:M17)","v":1},{"$f":"SUM('Haar Disciples'!N13:N17)","v":0},{"$f":"SUM('Haar Disciples'!O13:O17)","v":0},{"$f":"SUM('Haar Disciples'!P13:P17)","v":0},{"$f":"SUM('Haar Disciples'!Q13:Q17)","v":0},{"$f":"SUM('Haar Disciples'!R13:R17)","v":0},null,{"$f":"SUM('Haar Disciples'!T13:T17)","v":1},{"$f":"SUM('Haar Disciples'!U13:U17)","v":3},{"$f":"SUM('Haar Disciples'!V13:V17)","v":1},null,{"$f":"IF(ISERROR(G32/D32),0,G32/D32)","v":0.25},{"$f":"IF(ISERROR((4*J32+3*I32+2*H32+G32-SUM(H32:J32))/D32),0,(4*J32+3*I32+2*H32+G32-SUM(H32:J32))/D32)","v":0.375},{"$f":"W32+X32","v":0.625},{"$f":"IF(ISERROR((G32+L32+M32)/(D32+L32+M32+Q32)),0,(G32+L32+M32)/(D32+L32+M32+Q32))","v":0.29411764705882354},{"$f":"Z32+X32","v":0.66911764705882359},null,{"$f":"IF(ISERROR((S32+T32)/(U32+S32+T32)),0,(S32+T32)/(U32+S32+T32))","v":0.8}]
[{"$f":"'Karlsruhe Cougars'!A43","v":65},{"$f":"IF('Karlsruhe Cougars'!B43=\"\",\"\",'Karlsruhe Cougars'!B43)","v":"Rauprich"},{"$f":"SUM('Karlsruhe Cougars'!D43:D47)","v":10},{"$f":"SUM('Karlsruhe Cougars'!E43:E47)","v":5},{"$f":"SUM('Karlsruhe Cougars'!F43:F47)","v":3},{"$f":"SUM('Karlsruhe Cougars'!G43:G47)","v":1},{"$f":"SUM('Karlsruhe Cougars'!H43:H47)","v":1},{"$f":"SUM('Karlsruhe Cougars'!I43:I47)","v":0},{"$f":"SUM('Karlsruhe Cougars'!J43:J47)","v":0},{"$f":"SUM('Karlsruhe Cougars'!K43:K47)","v":0},{"$f":"SUM('Karlsruhe Cougars'!L43:L47)","v":2},{"$f":"SUM('Karlsruhe Cougars'!M43:M47)","v":5},{"$f":"SUM('Karlsruhe Cougars'!N43:N47)","v":0},{"$f":"SUM('Karlsruhe Cougars'!O43:O47)","v":0},{"$f":"SUM('Karlsruhe Cougars'!P43:P47)","v":0},{"$f":"SUM('Karlsruhe Cougars'!Q43:Q47)","v":0},{"$f":"SUM('Karlsruhe Cougars'!R43:R47)","v":0},null,{"$f":"SUM('Karlsruhe Cougars'!T43:T47)","v":2},{"$f":"SUM('Karlsruhe Cougars'!U43:U47)","v":4},{"$f":"SUM('Karlsruhe Cougars'!V43:V47)","v":1},null,{"$f":"IF(ISERROR(G33/D33),0,G33/D33)","v":0.2},{"$f":"IF(ISERROR((4*J33+3*I33+2*H33+G33-SUM(H33:J33))/D33),0,(4*J33+3*I33+2*H33+G33-SUM(H33:J33))/D33)","v":0.2},{"$f":"W33+X33","v":0.4},{"$f":"IF(ISERROR((G33+L33+M33)/(D33+L33+M33+Q33)),0,(G33+L33+M33)/(D33+L33+M33+Q33))","v":0.6},{"$f":"Z33+X33","v":0.8},null,{"$f":"IF(ISERROR((S33+T33)/(U33+S33+T33)),0,(S33+T33)/(U33+S33+T33))","v":0.8571428571428571}]
[{"$f":"'Freising Grizzlies'!A43","v":40},{"$f":"IF('Freising Grizzlies'!B43=\"\",\"\",'Freising Grizzlies'!B43)","v":"Brosch"},{"$f":"SUM('Freising Grizzlies'!D43:D47)","v":13},{"$f":"SUM('Freising Grizzlies'!E43:E47)","v":11},{"$f":"SUM('Freising Grizzlies'!F43:F47)","v":3},{"$f":"SUM('Freising Grizzlies'!G43:G47)","v":0},{"$f":"SUM('Freising Grizzlies'!H43:H47)","v":4},{"$f":"SUM('Freising Grizzlies'!I43:I47)","v":0},{"$f":"SUM('Freising Grizzlies'!J43:J47)","v":0},{"$f":"SUM('Freising Grizzlies'!K43:K47)","v":0},{"$f":"SUM('Freising Grizzlies'!L43:L47)","v":2},{"$f":"SUM('Freising Grizzlies'!M43:M47)","v":1},{"$f":"SUM('Freising Grizzlies'!N43:N47)","v":0},{"$f":"SUM('Freising Grizzlies'!O43:O47)","v":1},{"$f":"SUM('Freising Grizzlies'!P43:P47)","v":1},{"$f":"SUM('Freising Grizzlies'!Q43:Q47)","v":1},{"$f":"SUM('Freising Grizzlies'!R43:R47)","v":0},null,{"$f":"SUM('Freising Grizzlies'!T43:T47)","v":2},{"$f":"SUM('Freising Grizzlies'!U43:U47)","v":22},{"$f":"SUM('Freising Grizzlies'!V43:V47)","v":1},null,{"$f":"IF(ISERROR(G34/D34),0,G34/D34)","v":0.36363636363636365},{"$f":"IF(ISERROR((4*J34+3*I34+2*H34+G34-SUM(H34:J34))/D34),0,(4*J34+3*I34+2*H34+G34-SUM(H34:J34))/D34)","v":0.36363636363636365},{"$f":"W34+X34","v":0.72727272727272729},{"$f":"IF(ISERROR((G34+L34+M34)/(D34+L34+M34+Q34)),0,(G34+L34+M34)/(D34+L34+M34+Q34))","v":0.41666666666666669},{"$f":"Z34+X34","v":0.78030303030303028},null,{"$f":"IF(ISERROR((S34+T34)/(U34+S34+T34)),0,(S34+T34)/(U34+S34+T34))","v":0.96}]
[{"$f":"'Karlsruhe Cougars'!A38","v":64},{"$f":"IF('Karlsruhe Cougars'!B38=\"\",\"\",'Karlsruhe Cougars'!B38)","v":"Müller"},{"$f":"SUM('Karlsruhe Cougars'!D38:D42)","v":11},{"$f":"SUM('Karlsruhe Cougars'!E38:E42)","v":11},{"$f":"SUM('Karlsruhe Cougars'!F38:F42)","v":4},{"$f":"SUM('Karlsruhe Cougars'!G38:G42)","v":0},{"$f":"SUM('Karlsruhe Cougars'!H38:H42)","v":4},{"$f":"SUM('Karlsruhe Cougars'!I38:I42)","v":0},{"$f":"SUM('Karlsruhe Cougars'!J38:J42)","v":0},{"$f":"SUM('Karlsruhe Cougars'!K38:K42)","v":0},{"$f":"SUM('Karlsruhe Cougars'!L38:L42)","v":1},{"$f":"SUM('Karlsruhe Cougars'!M38:M42)","v":0},{"$f":"SUM('Karlsruhe Cougars'!N38:N42)","v":0},{"$f":"SUM('Karlsruhe Cougars'!O38:O42)","v":0},{"$f":"SUM('Karlsruhe Cougars'!P38:P42)","v":0},{"$f":"SUM('Karlsruhe Cougars'!Q38:Q42)","v":0},{"$f":"SUM('Karlsruhe Cougars'!R38:R42)","v":0},null,{"$f":"SUM('Karlsruhe Cougars'!T38:T42)","v":2},{"$f":"SUM('Karlsruhe Cougars'!U38:U42)","v":4},{"$f":"SUM('Karlsruhe Cougars'!V38:V42)","v":1},null,{"$f":"IF(ISERROR(G35/D35),0,G35/D35)","v":0.36363636363636365},{"$f":"IF(ISERROR((4*J35+3*I35+2*H35+G35-SUM(H35:J35))/D35),0,(4*J35+3*I35+2*H35+G35-SUM(H35:J35))/D35)","v":0.36363636363636365},{"$f":"W35+X35","v":0.72727272727272729},{"$f":"IF(ISERROR((G35+L35+M35)/(D35+L35+M35+Q35)),0,(G35+L35+M35)/(D35+L35+M35+Q35))","v":0.36363636363636365},{"$f":"Z35+X35","v":0.72727272727272729},null,{"$f":"IF(ISERROR((S35+T35)/(U35+S35+T35)),0,(S35+T35)/(U35+S35+T35))","v":0.8571428571428571}]
[{"$f":"'Karlsruhe Cougars'!A8","v":58},{"$f":"IF('Karlsruhe Cougars'!B8=\"\",\"\",'Karlsruhe Cougars'!B8)","v":"Seso"},{"$f":"SUM('Karlsruhe Cougars'!D8:D12)","v":12},{"$f":"SUM('Karlsruhe Cougars'!E8:E12)","v":10},{"$f":"SUM('Karlsruhe Cougars'!F8:F12)","v":3},{"$f":"SUM('Karlsruhe Cougars'!G8:G12)","v":1},{"$f":"SUM('Karlsruhe Cougars'!H8:H12)","v":3},{"$f":"SUM('Karlsruhe Cougars'!I8:I12)","v":0},{"$f":"SUM('Karlsruhe Cougars'!J8:J12)","v":0},{"$f":"SUM('Karlsruhe Cougars'!K8:K12)","v":0},{"$f":"SUM('Karlsruhe Cougars'!L8:L12)","v":3},{"$f":"SUM('Karlsruhe Cougars'!M8:M12)","v":1},{"$f":"SUM('Karlsruhe Cougars'!N8:N12)","v":1},{"$f":"SUM('Karlsruhe Cougars'!O8:O12)","v":1},{"$f":"SUM('Karlsruhe Cougars'!P8:P12)","v":0},{"$f":"SUM('Karlsruhe Cougars'!Q8:Q12)","v":0},{"$f":"SUM('Karlsruhe Cougars'!R8:R12)","v":0},null,{"$f":"SUM('Karlsruhe Cougars'!T8:T12)","v":2},{"$f":"SUM('Karlsruhe Cougars'!U8:U12)","v":9},{"$f":"SUM('Karlsruhe Cougars'!V8:V12)","v":3},null,{"$f":"IF(ISERROR(G36/D36),0,G36/D36)","v":0.3},{"$f":"IF(ISERROR((4*J36+3*I36+2*H36+G36-SUM(H36:J36))/D36),0,(4*J36+3*I36+2*H36+G36-SUM(H36:J36))/D36)","v":0.3},{"$f":"W36+X36","v":0.6},{"$f":"IF(ISERROR((G36+L36+M36)/(D36+L36+M36+Q36)),0,(G36+L36+M36)/(D36+L36+M36+Q36))","v":0.41666666666666669},{"$f":"Z36+X36","v":0.71666666666666667},null,{"$f":"IF(ISERROR((S36+T36)/(U36+S36+T36)),0,(S36+T36)/(U36+S36+T36))","v":0.7857142857142857}]
[{"$f":"'Neunkirchen Nightmares'!A33","v":73},{"$f":"IF('Neunkirchen Nightmares'!B33=\"\",\"\",'Neunkirchen Nightmares'!B33)","v":"Hupperich"},{"$f":"SUM('Neunkirchen Nightmares'!D33:D37)","v":7},{"$f":"SUM('Neunkirchen Nightmares'!E33:E37)","v":2},{"$f":"SUM('Neunkirchen Nightmares'!F33:F37)","v":2},{"$f":"SUM('Neunkirchen Nightmares'!G33:G37)","v":0},{"$f":"SUM('Neunkirchen Nightmares'!H33:H37)","v":0},{"$f":"SUM('Neunkirchen Nightmares'!I33:I37)","v":0},{"$f":"SUM('Neunkirchen Nightmares'!J33:J37)","v":0},{"$f":"SUM('Neunkirchen Nightmares'!K33:K37)","v":0},{"$f":"SUM('Neunkirchen Nightmares'!L33:L37)","v":2},{"$f":"SUM('Neunkirchen Nightmares'!M33:M37)","v":5},{"$f":"SUM('Neunkirchen Nightmares'!N33:N37)","v":0},{"$f":"SUM('Neunkirchen Nightmares'!O33:O37)","v":2},{"$f":"SUM('Neunkirchen Nightmares'!P33:P37)","v":0},{"$f":"SUM('Neunkirchen Nightmares'!Q33:Q37)","v":0},{"$f":"SUM('Neunkirchen Nightmares'!R33:R37)","v":0},null,{"$f":"SUM('Neunkirchen Nightmares'!T33:T37)","v":1},{"$f":"SUM('Neunkirchen Nightmares'!U33:U37)","v":0},{"$f":"SUM('Neunkirchen Nightmares'!V33:V37)","v":0},null,{"$f":"IF(ISERROR(G37/D37),0,G37/D37)","v":0},{"$f":"IF(ISERROR((4*J37+3*I37+2*H37+G37-SUM(H37:J37))/D37),0,(4*J37+3*I37+2*H37+G37-SUM(H37:J37))/D37)","v":0},{"$f":"W37+X37","v":0},{"$f":"IF(ISERROR((G37+L37+M37)/(D37+L37+M37+Q37)),0,(G37+L37+M37)/(D37+L37+M37+Q37))","v":0.7142857142857143},{"$f":"Z37+X37","v":0.7142857142857143},null,{"$f":"IF(ISERROR((S37+T37)/(U37+S37+T37)),0,(S37+T37)/(U37+S37+T37))","v":1}]
[{"$f":"'Neunkirchen Nightmares'!A38","v":74},{"$f":"IF('Neunkirchen Nightmares'!B38=\"\",\"\",'Neunkirchen Nightmares'!B38)","v":"Kaufner"},{"$f":"SUM('Neunkirchen Nightmares'!D38:D42)","v":7},{"$f":"SUM('Neunkirchen Nightmares'!E38:E42)","v":2},{"$f":"SUM('Neunkirchen Nightmares'!F38:F42)","v":2},{"$f":"SUM('Neunkirchen Nightmares'!G38:G42)","v":1},{"$f":"SUM('Neunkirchen Nightmares'!H38:H42)","v":0},{"$f":"SUM('Neunkirchen Nightmares'!I38:I42)","v":0},{"$f":"SUM('Neunkirchen Nightmares'!J38:J42)","v":0},{"$f":"SUM('Neunkirchen Nightmares'!K38:K42)","v":0},{"$f":"SUM('Neunkirchen Nightmares'!L38:L42)","v":2},{"$f":"SUM('Neunkirchen Nightmares'!M38:M42)","v":4},{"$f":"SUM('Neunkirchen Nightmares'!N38:N42)","v":0},{"$f":"SUM('Neunkirchen Nightmares'!O38:O42)","v":0},{"$f":"SUM('Neunkirchen Nightmares'!P38:P42)","v":0},{"$f":"SUM('Neunkirchen Nightmares'!Q38:Q42)","v":1},{"$f":"SUM('Neunkirchen Nightmares'!R38:R42)","v":0},null,{"$f":"SUM('Neunkirchen Nightmares'!T38:T42)","v":0},{"$f":"SUM('Neunkirchen Nightmares'!U38:U42)","v":0},{"$f":"SUM('Neunkirchen Nightmares'!V38:V42)","v":0},null,{"$f":"IF(ISERROR(G38/D38),0,G38/D38)","v":0},{"$f":"IF(ISERROR((4*J38+3*I38+2*H38+G38-SUM(H38:J38))/D38),0,(4*J38+3*I38+2*H38+G38-SUM(H38:J38))/D38)","v":0},{"$f":"W38+X38","v":0},{"$f":"IF(ISERROR((G38+L38+M38)/(D38+L38+M38+Q38)),0,(G38+L38+M38)/(D38+L38+M38+Q38))","v":0.66666666666666663},{"$f":"Z38+X38","v":0.66666666666666663},null,{"$f":"IF(ISERROR((S38+T38)/(U38+S38+T38)),0,(S38+T38)/(U38+S38+T38))","v":0}]
[{"$f":"'Knights 2'!A13","v":20},{"$f":"IF('Knights 2'!B13=\"\",\"\",'Knights 2'!B13)","v":"Piotrowski"},{"$f":"SUM('Knights 2'!D13:D17)","v":3},{"$f":"SUM('Knights 2'!E13:E17)","v":3},{"$f":"SUM('Knights 2'!F13:F17)","v":0},{"$f":"SUM('Knights 2'!G13:G17)","v":1},{"$f":"SUM('Knights 2'!H13:H17)","v":1},{"$f":"SUM('Knights 2'!I13:I17)","v":0},{"$f":"SUM('Knights 2'!J13:J17)","v":0},{"$f":"SUM('Knights 2'!K13:K17)","v":0},{"$f":"SUM('Knights 2'!L13:L17)","v":0},{"$f":"SUM('Knights 2'!M13:M17)","v":0},{"$f":"SUM('Knights 2'!N13:N17)","v":0},{"$f":"SUM('Knights 2'!O13:O17)","v":0},{"$f":"SUM('Knights 2'!P13:P17)","v":0},{"$f":"SUM('Knights 2'!Q13:Q17)","v":0},{"$f":"SUM('Knights 2'!R13:R17)","v":0},null,{"$f":"SUM('Knights 2'!T13:T17)","v":1},{"$f":"SUM('Knights 2'!U13:U17)","v":0},{"$f":"SUM('Knights 2'!V13:V17)","v":0},null,{"$f":"IF(ISERROR(G39/D39),0,G39/D39)","v":0.33333333333333331},{"$f":"IF(ISERROR((4*J39+3*I39+2*H39+G39-SUM(H39:J39))/D39),0,(4*J39+3*I39+2*H39+G39-SUM(H39:J39))/D39)","v":0.33333333333333331},{"$f":"W39+X39","v":0.66666666666666663},{"$f":"IF(ISERROR((G39+L39+M39)/(D39+L39+M39+Q39)),0,(G39+L39+M39)/(D39+L39+M39+Q39))","v":0.33333333333333331},{"$f":"Z39+X39","v":0.66666666666666663},null,{"$f":"IF(ISERROR((S39+T39)/(U39+S39+T39)),0,(S39+T39)/(U39+S39+T39))","v":1}]
[{"$f":"'Hamburg Knights'!A38","v":8},{"$f":"IF('Hamburg Knights'!B38=\"\",\"\",'Hamburg Knights'!B38)","v":"Feistel"},{"$f":"SUM('Hamburg Knights'!D38:D42)","v":3},{"$f":"SUM('Hamburg Knights'!E38:E42)","v":3},{"$f":"SUM('Hamburg Knights'!F38:F42)","v":0},{"$f":"SUM('Hamburg Knights'!G38:G42)","v":1},{"$f":"SUM('Hamburg Knights'!H38:H42)","v":1},{"$f":"SUM('Hamburg Knights'!I38:I42)","v":0},{"$f":"SUM('Hamburg Knights'!J38:J42)","v":0},{"$f":"SUM('Hamburg Knights'!K38:K42)","v":0},{"$f":"SUM('Hamburg Knights'!L38:L42)","v":0},{"$f":"SUM('Hamburg Knights'!M38:M42)","v":0},{"$f":"SUM('Hamburg Knights'!N38:N42)","v":0},{"$f":"SUM('Hamburg Knights'!O38:O42)","v":0},{"$f":"SUM('Hamburg Knights'!P38:P42)","v":1},{"$f":"SUM('Hamburg Knights'!Q38:Q42)","v":0},{"$f":"SUM('Hamburg Knights'!R38:R42)","v":0},null,{"$f":"SUM('Hamburg Knights'!T38:T42)","v":0},{"$f":"SUM('Hamburg Knights'!U38:U42)","v":0},{"$f":"SUM('Hamburg Knights'!V38:V42)","v":0},null,{"$f":"IF(ISERROR(G40/D40),0,G40/D40)","v":0.33333333333333331},{"$f":"IF(ISERROR((4*J40+3*I40+2*H40+G40-SUM(H40:J40))/D40),0,(4*J40+3*I40+2*H40+G40-SUM(H40:J40))/D40)","v":0.33333333333333331},{"$f":"W40+X40","v":0.66666666666666663},{"$f":"IF(ISERROR((G40+L40+M40)/(D40+L40+M40+Q40)),0,(G40+L40+M40)/(D40+L40+M40+Q40))","v":0.33333333333333331},{"$f":"Z40+X40","v":0.66666666666666663},null,{"$f":"IF(ISERROR((S40+T40)/(U40+S40+T40)),0,(S40+T40)/(U40+S40+T40))","v":0}]
[{"$f":"'Freising Grizzlies'!A23","v":36},{"$f":"IF('Freising Grizzlies'!B23=\"\",\"\",'Freising Grizzlies'!B23)","v":"Salomon"},{"$f":"SUM('Freising Grizzlies'!D23:D27)","v":16},{"$f":"SUM('Freising Grizzlies'!E23:E27)","v":10},{"$f":"SUM('Freising Grizzlies'!F23:F27)","v":6},{"$f":"SUM('Freising Grizzlies'!G23:G27)","v":4},{"$f":"SUM('Freising Grizzlies'!H23:H27)","v":2},{"$f":"SUM('Freising Grizzlies'!I23:I27)","v":0},{"$f":"SUM('Freising Grizzlies'!J23:J27)","v":0},{"$f":"SUM('Freising Grizzlies'!K23:K27)","v":0},{"$f":"SUM('Freising Grizzlies'!L23:L27)","v":1},{"$f":"SUM('Freising Grizzlies'!M23:M27)","v":4},{"$f":"SUM('Freising Grizzlies'!N23:N27)","v":0},{"$f":"SUM('Freising Grizzlies'!O23:O27)","v":1},{"$f":"SUM('Freising Grizzlies'!P23:P27)","v":0},{"$f":"SUM('Freising Grizzlies'!Q23:Q27)","v":1},{"$f":"SUM('Freising Grizzlies'!R23:R27)","v":0},null,{"$f":"SUM('Freising Grizzlies'!T23:T27)","v":2},{"$f":"SUM('Freising Grizzlies'!U23:U27)","v":1},{"$f":"SUM('Freising Grizzlies'!V23:V27)","v":0},null,{"$f":"IF(ISERROR(G41/D41),0,G41/D41)","v":0.2},{"$f":"IF(ISERROR((4*J41+3*I41+2*H41+G41-SUM(H41:J41))/D41),0,(4*J41+3*I41+2*H41+G41-SUM(H41:J41))/D41)","v":0.2},{"$f":"W41+X41","v":0.4},{"$f":"IF(ISERROR((G41+L41+M41)/(D41+L41+M41+Q41)),0,(G41+L41+M41)/(D41+L41+M41+Q41))","v":0.42857142857142855},{"$f":"Z41+X41","v":0.62857142857142856},null,{"$f":"IF(ISERROR((S41+T41)/(U41+S41+T41)),0,(S41+T41)/(U41+S41+T41))","v":1}]
[{"$f":"'Neunkirchen Nightmares'!A28","v":72},{"$f":"IF('Neunkirchen Nightmares'!B28=\"\",\"\",'Neunkirchen Nightmares'!B28)","v":"Singer"},{"$f":"SUM('Neunkirchen Nightmares'!D28:D32)","v":7},{"$f":"SUM('Neunkirchen Nightmares'!E28:E32)","v":5},{"$f":"SUM('Neunkirchen Nightmares'!F28:F32)","v":0},{"$f":"SUM('Neunkirchen Nightmares'!G28:G32)","v":0},{"$f":"SUM('Neunkirchen Nightmares'!H28:H32)","v":1},{"$f":"SUM('Neunkirchen Nightmares'!I28:I32)","v":0},{"$f":"SUM('Neunkirchen Nightmares'!J28:J32)","v":0},{"$f":"SUM('Neunkirchen Nightmares'!K28:K32)","v":0},{"$f":"SUM('Neunkirchen Nightmares'!L28:L32)","v":1},{"$f":"SUM('Neunkirchen Nightmares'!M28:M32)","v":2},{"$f":"SUM('Neunkirchen Nightmares'!N28:N32)","v":0},{"$f":"SUM('Neunkirchen Nightmares'!O28:O32)","v":3},{"$f":"SUM('Neunkirchen Nightmares'!P28:P32)","v":0},{"$f":"SUM('Neunkirchen Nightmares'!Q28:Q32)","v":0},{"$f":"SUM('Neunkirchen Nightmares'!R28:R32)","v":0},null,{"$f":"SUM('Neunkirchen Nightmares'!T28:T32)","v":0},{"$f":"SUM('Neunkirchen Nightmares'!U28:U32)","v":0},{"$f":"SUM('Neunkirchen Nightmares'!V28:V32)","v":2},null,{"$f":"IF(ISERROR(G42/D42),0,G42/D42)","v":0.2},{"$f":"IF(ISERROR((4*J42+3*I42+2*H42+G42-SUM(H42:J42))/D42),0,(4*J42+3*I42+2*H42+G42-SUM(H42:J42))/D42)","v":0.2},{"$f":"W42+X42","v":0.4},{"$f":"IF(ISERROR((G42+L42+M42)/(D42+L42+M42+Q42)),0,(G42+L42+M42)/(D42+L42+M42+Q42))","v":0.42857142857142855},{"$f":"Z42+X42","v":0.62857142857142856},null,{"$f":"IF(ISERROR((S42+T42)/(U42+S42+T42)),0,(S42+T42)/(U42+S42+T42))","v":0}]
[{"$f":"'Neunkirchen Nightmares'!A13","v":69},{"$f":"IF('Neunkirchen Nightmares'!B13=\"\",\"\",'Neunkirchen Nightmares'!B13)","v":"Weyer"},{"$f":"SUM('Neunkirchen Nightmares'!D13:D17)","v":9},{"$f":"SUM('Neunkirchen Nightmares'!E13:E17)","v":6},{"$f":"SUM('Neunkirchen Nightmares'!F13:F17)","v":4},{"$f":"SUM('Neunkirchen Nightmares'!G13:G17)","v":0},{"$f":"SUM('Neunkirchen Nightmares'!H13:H17)","v":1},{"$f":"SUM('Neunkirchen Nightmares'!I13:I17)","v":0},{"$f":"SUM('Neunkirchen Nightmares'!J13:J17)","v":0},{"$f":"SUM('Neunkirchen Nightmares'!K13:K17)","v":0},{"$f":"SUM('Neunkirchen Nightmares'!L13:L17)","v":0},{"$f":"SUM('Neunkirchen Nightmares'!M13:M17)","v":3},{"$f":"SUM('Neunkirchen Nightmares'!N13:N17)","v":0},{"$f":"SUM('Neunkirchen Nightmares'!O13:O17)","v":1},{"$f":"SUM('Neunkirchen Nightmares'!P13:P17)","v":0},{"$f":"SUM('Neunkirchen Nightmares'!Q13:Q17)","v":0},{"$f":"SUM('Neunkirchen Nightmares'!R13:R17)","v":0},null,{"$f":"SUM('Neunkirchen Nightmares'!T13:T17)","v":2},{"$f":"SUM('Neunkirchen Nightmares'!U13:U17)","v":1},{"$f":"SUM('Neunkirchen Nightmares'!V13:V17)","v":3},null,{"$f":"IF(ISERROR(G43/D43),0,G43/D43)","v":0.16666666666666666},{"$f":"IF(ISERROR((4*J43+3*I43+2*H43+G43-SUM(H43:J43))/D43),0,(4*J43+3*I43+2*H43+G43-SUM(H43:J43))/D43)","v":0.16666666666666666},{"$f":"W43+X43","v":0.33333333333333331},{"$f":"IF(ISERROR((G43+L43+M43)/(D43+L43+M43+Q43)),0,(G43+L43+M43)/(D43+L43+M43+Q43))","v":0.44444444444444442},{"$f":"Z43+X43","v":0.61111111111111105},null,{"$f":"IF(ISERROR((S43+T43)/(U43+S43+T43)),0,(S43+T43)/(U43+S43+T43))","v":0.5}]
[{"$f":"'Neunkirchen Nightmares'!A3","v":67},{"$f":"IF('Neunkirchen Nightmares'!B3=\"\",\"\",'Neunkirchen Nightmares'!B3)","v":"Lamersdorf"},{"$f":"SUM('Neunkirchen Nightmares'!D3:D7)","v":11},{"$f":"SUM('Neunkirchen Nightmares'!E3:E7)","v":7},{"$f":"SUM('Neunkirchen Nightmares'!F3:F7)","v":4},{"$f":"SUM('Neunkirchen Nightmares'!G3:G7)","v":1},{"$f":"SUM('Neunkirchen Nightmares'!H3:H7)","v":1},{"$f":"SUM('Neunkirchen Nightmares'!I3:I7)","v":0},{"$f":"SUM('Neunkirchen Nightmares'!J3:J7)","v":0},{"$f":"SUM('Neunkirchen Nightmares'!K3:K7)","v":0},{"$f":"SUM('Neunkirchen Nightmares'!L3:L7)","v":1},{"$f":"SUM('Neunkirchen Nightmares'!M3:M7)","v":4},{"$f":"SUM('Neunkirchen Nightmares'!N3:N7)","v":0},{"$f":"SUM('Neunkirchen Nightmares'!O3:O7)","v":1},{"$f":"SUM('Neunkirchen Nightmares'!P3:P7)","v":0},{"$f":"SUM('Neunkirchen Nightmares'!Q3:Q7)","v":0},{"$f":"SUM('Neunkirchen Nightmares'!R3:R7)","v":0},null,{"$f":"SUM('Neunkirchen Nightmares'!T3:T7)","v":2},{"$f":"SUM('Neunkirchen Nightmares'!U3:U7)","v":7},{"$f":"SUM('Neunkirchen Nightmares'!V3:V7)","v":3},null,{"$f":"IF(ISERROR(G44/D44),0,G44/D44)","v":0.14285714285714285},{"$f":"IF(ISERROR((4*J44+3*I44+2*H44+G44-SUM(H44:J44))/D44),0,(4*J44+3*I44+2*H44+G44-SUM(H44:J44))/D44)","v":0.14285714285714285},{"$f":"W44+X44","v":0.2857142857142857},{"$f":"IF(ISERROR((G44+L44+M44)/(D44+L44+M44+Q44)),0,(G44+L44+M44)/(D44+L44+M44+Q44))","v":0.45454545454545453},{"$f":"Z44+X44","v":0.59740259740259738},null,{"$f":"IF(ISERROR((S44+T44)/(U44+S44+T44)),0,(S44+T44)/(U44+S44+T44))","v":0.75}]
[{"$f":"'Haar Disciples'!A38","v":50},{"$f":"IF('Haar Disciples'!B38=\"\",\"\",'Haar Disciples'!B38)","v":"Reinisch, Sophie"},{"$f":"SUM('Haar Disciples'!D38:D42)","v":17},{"$f":"SUM('Haar Disciples'!E38:E42)","v":13},{"$f":"SUM('Haar Disciples'!F38:F42)","v":3},{"$f":"SUM('Haar Disciples'!G38:G42)","v":4},{"$f":"SUM('Haar Disciples'!H38:H42)","v":3},{"$f":"SUM('Haar Disciples'!I38:I42)","v":0},{"$f":"SUM('Haar Disciples'!J38:J42)","v":0},{"$f":"SUM('Haar Disciples'!K38:K42)","v":0},{"$f":"SUM('Haar Disciples'!L38:L42)","v":1},{"$f":"SUM('Haar Disciples'!M38:M42)","v":3},{"$f":"SUM('Haar Disciples'!N38:N42)","v":1},{"$f":"SUM('Haar Disciples'!O38:O42)","v":2},{"$f":"SUM('Haar Disciples'!P38:P42)","v":0},{"$f":"SUM('Haar Disciples'!Q38:Q42)","v":0},{"$f":"SUM('Haar Disciples'!R38:R42)","v":0},null,{"$f":"SUM('Haar Disciples'!T38:T42)","v":7},{"$f":"SUM('Haar Disciples'!U38:U42)","v":3},{"$f":"SUM('Haar Disciples'!V38:V42)","v":2},null,{"$f":"IF(ISERROR(G45/D45),0,G45/D45)","v":0.23076923076923078},{"$f":"IF(ISERROR((4*J45+3*I45+2*H45+G45-SUM(H45:J45))/D45),0,(4*J45+3*I45+2*H45+G45-SUM(H45:J45))/D45)","v":0.23076923076923078},{"$f":"W45+X45","v":0.46153846153846156},{"$f":"IF(ISERROR((G45+L45+M45)/(D45+L45+M45+Q45)),0,(G45+L45+M45)/(D45+L45+M45+Q45))","v":0.41176470588235292},{"$f":"Z45+X45","v":0.64253393665158365},null,{"$f":"IF(ISERROR((S45+T45)/(U45+S45+T45)),0,(S45+T45)/(U45+S45+T45))","v":0.83333333333333337}]
[{"$f":"'Wesseling Vermins'!A43","v":29},{"$f":"IF('Wesseling Vermins'!B43=\"\",\"\",'Wesseling Vermins'!B43)","v":"Kowalewski"},{"$f":"SUM('Wesseling Vermins'!D43:D47)","v":9},{"$f":"SUM('Wesseling Vermins'!E43:E47)","v":8},{"$f":"SUM('Wesseling Vermins'!F43:F47)","v":3},{"$f":"SUM('Wesseling Vermins'!G43:G47)","v":1},{"$f":"SUM('Wesseling Vermins'!H43:H47)","v":2},{"$f":"SUM('Wesseling Vermins'!I43:I47)","v":0},{"$f":"SUM('Wesseling Vermins'!J43:J47)","v":0},{"$f":"SUM('Wesseling Vermins'!K43:K47)","v":0},{"$f":"SUM('Wesseling Vermins'!L43:L47)","v":2},{"$f":"SUM('Wesseling Vermins'!M43:M47)","v":1},{"$f":"SUM('Wesseling Vermins'!N43:N47)","v":0},{"$f":"SUM('Wesseling Vermins'!O43:O47)","v":0},{"$f":"SUM('Wesseling Vermins'!P43:P47)","v":0},{"$f":"SUM('Wesseling Vermins'!Q43:Q47)","v":0},{"$f":"SUM('Wesseling Vermins'!R43:R47)","v":0},null,{"$f":"SUM('Wesseling Vermins'!T43:T47)","v":0},{"$f":"SUM('Wesseling Vermins'!U43:U47)","v":20},{"$f":"SUM('Wesseling Vermins'!V43:V47)","v":1},null,{"$f":"IF(ISERROR(G46/D46),0,G46/D46)","v":0.25},{"$f":"IF(ISERROR((4*J46+3*I46+2*H46+G46-SUM(H46:J46))/D46),0,(4*J46+3*I46+2*H46+G46-SUM(H46:J46))/D46)","v":0.25},{"$f":"W46+X46","v":0.5},{"$f":"IF(ISERROR((G46+L46+M46)/(D46+L46+M46+Q46)),0,(G46+L46+M46)/(D46+L46+M46+Q46))","v":0.33333333333333331},{"$f":"Z46+X46","v":0.58333333333333326},null,{"$f":"IF(ISERROR((S46+T46)/(U46+S46+T46)),0,(S46+T46)/(U46+S46+T46))","v":0.95238095238095233}]
[{"$f":"'Haar Disciples'!A23","v":47},{"$f":"IF('Haar Disciples'!B23=\"\",\"\",'Haar Disciples'!B23)","v":"Mohr"},{"$f":"SUM('Haar Disciples'!D23:D27)","v":12},{"$f":"SUM('Haar Disciples'!E23:E27)","v":7},{"$f":"SUM('Haar Disciples'!F23:F27)","v":4},{"$f":"SUM('Haar Disciples'!G23:G27)","v":1},{"$f":"SUM('Haar Disciples'!H23:H27)","v":1},{"$f":"SUM('Haar Disciples'!I23:I27)","v":0},{"$f":"SUM('Haar Disciples'!J23:J27)","v":0},{"$f":"SUM('Haar Disciples'!K23:K27)","v":0},{"$f":"SUM('Haar Disciples'!L23:L27)","v":3},{"$f":"SUM('Haar Disciples'!M23:M27)","v":5},{"$f":"SUM('Haar Disciples'!N23:N27)","v":0},{"$f":"SUM('Haar Disciples'!O23:O27)","v":1},{"$f":"SUM('Haar Disciples'!P23:P27)","v":0},{"$f":"SUM('Haar Disciples'!Q23:Q27)","v":0},{"$f":"SUM('Haar Disciples'!R23:R27)","v":0},null,{"$f":"SUM('Haar Disciples'!T23:T27)","v":3},{"$f":"SUM('Haar Disciples'!U23:U27)","v":6},{"$f":"SUM('Haar Disciples'!V23:V27)","v":1},null,{"$f":"IF(ISERROR(G47/D47),0,G47/D47)","v":0.14285714285714285},{"$f":"IF(ISERROR((4*J47+3*I47+2*H47+G47-SUM(H47:J47))/D47),0,(4*J47+3*I47+2*H47+G47-SUM(H47:J47))/D47)","v":0.14285714285714285},{"$f":"W47+X47","v":0.2857142857142857},{"$f":"IF(ISERROR((G47+L47+M47)/(D47+L47+M47+Q47)),0,(G47+L47+M47)/(D47+L47+M47+Q47))","v":0.5},{"$f":"Z47+X47","v":0.64285714285714279},null,{"$f":"IF(ISERROR((S47+T47)/(U47+S47+T47)),0,(S47+T47)/(U47+S47+T47))","v":0.9}]
[{"$f":"'Wesseling Vermins'!A38","v":28},{"$f":"IF('Wesseling Vermins'!B38=\"\",\"\",'Wesseling Vermins'!B38)","v":"Wolff"},{"$f":"SUM('Wesseling Vermins'!D38:D42)","v":8},{"$f":"SUM('Wesseling Vermins'!E38:E42)","v":4},{"$f":"SUM('Wesseling Vermins'!F38:F42)","v":2},{"$f":"SUM('Wesseling Vermins'!G38:G42)","v":1},{"$f":"SUM('Wesseling Vermins'!H38:H42)","v":0},{"$f":"SUM('Wesseling Vermins'!I38:I42)","v":0},{"$f":"SUM('Wesseling Vermins'!J38:J42)","v":0},{"$f":"SUM('Wesseling Vermins'!K38:K42)","v":0},{"$f":"SUM('Wesseling Vermins'!L38:L42)","v":1},{"$f":"SUM('Wesseling Vermins'!M38:M42)","v":4},{"$f":"SUM('Wesseling Vermins'!N38:N42)","v":0},{"$f":"SUM('Wesseling Vermins'!O38:O42)","v":0},{"$f":"SUM('Wesseling Vermins'!P38:P42)","v":0},{"$f":"SUM('Wesseling Vermins'!Q38:Q42)","v":0},{"$f":"SUM('Wesseling Vermins'!R38:R42)","v":0},null,{"$f":"SUM('Wesseling Vermins'!T38:T42)","v":0},{"$f":"SUM('Wesseling Vermins'!U38:U42)","v":2},{"$f":"SUM('Wesseling Vermins'!V38:V42)","v":0},null,{"$f":"IF(ISERROR(G48/D48),0,G48/D48)","v":0},{"$f":"IF(ISERROR((4*J48+3*I48+2*H48+G48-SUM(H48:J48))/D48),0,(4*J48+3*I48+2*H48+G48-SUM(H48:J48))/D48)","v":0},{"$f":"W48+X48","v":0},{"$f":"IF(ISERROR((G48+L48+M48)/(D48+L48+M48+Q48)),0,(G48+L48+M48)/(D48+L48+M48+Q48))","v":0.5},{"$f":"Z48+X48","v":0.5},null,{"$f":"IF(ISERROR((S48+T48)/(U48+S48+T48)),0,(S48+T48)/(U48+S48+T48))","v":1}]
[{"$f":"'Hamburg Knights'!A73","v":15},{"$f":"IF('Hamburg Knights'!B73=\"\",\"\",'Hamburg Knights'!B73)","v":"Rathjen"},{"$f":"SUM('Hamburg Knights'!D73:D77)","v":4},{"$f":"SUM('Hamburg Knights'!E73:E77)","v":2},{"$f":"SUM('Hamburg Knights'!F73:F77)","v":2},{"$f":"SUM('Hamburg Knights'!G73:G77)","v":0},{"$f":"SUM('Hamburg Knights'!H73:H77)","v":0},{"$f":"SUM('Hamburg Knights'!I73:I77)","v":0},{"$f":"SUM('Hamburg Knights'!J73:J77)","v":0},{"$f":"SUM('Hamburg Knights'!K73:K77)","v":0},{"$f":"SUM('Hamburg Knights'!L73:L77)","v":0},{"$f":"SUM('Hamburg Knights'!M73:M77)","v":2},{"$f":"SUM('Hamburg Knights'!N73:N77)","v":0},{"$f":"SUM('Hamburg Knights'!O73:O77)","v":1},{"$f":"SUM('Hamburg Knights'!P73:P77)","v":0},{"$f":"SUM('Hamburg Knights'!Q73:Q77)","v":0},{"$f":"SUM('Hamburg Knights'!R73:R77)","v":0},null,{"$f":"SUM('Hamburg Knights'!T73:T77)","v":1},{"$f":"SUM('Hamburg Knights'!U73:U77)","v":2},{"$f":"SUM('Hamburg Knights'!V73:V77)","v":2},null,{"$f":"IF(ISERROR(G49/D49),0,G49/D49)","v":0},{"$f":"IF(ISERROR((4*J49+3*I49+2*H49+G49-SUM(H49:J49))/D49),0,(4*J49+3*I49+2*H49+G49-SUM(H49:J49))/D49)","v":0},{"$f":"W49+X49","v":0},{"$f":"IF(ISERROR((G49+L49+M49)/(D49+L49+M49+Q49)),0,(G49+L49+M49)/(D49+L49+M49+Q49))","v":0.5},{"$f":"Z49+X49","v":0.5},null,{"$f":"IF(ISERROR((S49+T49)/(U49+S49+T49)),0,(S49+T49)/(U49+S49+T49))","v":0.6}]
[{"$f":"'Knights 2'!A3","v":18},{"$f":"IF('Knights 2'!B3=\"\",\"\",'Knights 2'!B3)","v":"Lühr"},{"$f":"SUM('Knights 2'!D3:D7)","v":4},{"$f":"SUM('Knights 2'!E3:E7)","v":4},{"$f":"SUM('Knights 2'!F3:F7)","v":1},{"$f":"SUM('Knights 2'!G3:G7)","v":0},{"$f":"SUM('Knights 2'!H3:H7)","v":1},{"$f":"SUM('Knights 2'!I3:I7)","v":0},{"$f":"SUM('Knights 2'!J3:J7)","v":0},{"$f":"SUM('Knights 2'!K3:K7)","v":0},{"$f":"SUM('Knights 2'!L3:L7)","v":1},{"$f":"SUM('Knights 2'!M3:M7)","v":0},{"$f":"SUM('Knights 2'!N3:N7)","v":0},{"$f":"SUM('Knights 2'!O3:O7)","v":0},{"$f":"SUM('Knights 2'!P3:P7)","v":0},{"$f":"SUM('Knights 2'!Q3:Q7)","v":0},{"$f":"SUM('Knights 2'!R3:R7)","v":0},null,{"$f":"SUM('Knights 2'!T3:T7)","v":0},{"$f":"SUM('Knights 2'!U3:U7)","v":0},{"$f":"SUM('Knights 2'!V3:V7)","v":0},null,{"$f":"IF(ISERROR(G50/D50),0,G50/D50)","v":0.25},{"$f":"IF(ISERROR((4*J50+3*I50+2*H50+G50-SUM(H50:J50))/D50),0,(4*J50+3*I50+2*H50+G50-SUM(H50:J50))/D50)","v":0.25},{"$f":"W50+X50","v":0.5},{"$f":"IF(ISERROR((G50+L50+M50)/(D50+L50+M50+Q50)),0,(G50+L50+M50)/(D50+L50+M50+Q50))","v":0.25},{"$f":"Z50+X50","v":0.5},null,{"$f":"IF(ISERROR((S50+T50)/(U50+S50+T50)),0,(S50+T50)/(U50+S50+T50))","v":0}]
[{"$f":"'Haar Disciples'!A63","v":55},{"$f":"IF('Haar Disciples'!B63=\"\",\"\",'Haar Disciples'!B63)","v":"Harvey"},{"$f":"SUM('Haar Disciples'!D63:D67)","v":2},{"$f":"SUM('Haar Disciples'!E63:E67)","v":1},{"$f":"SUM('Haar Disciples'!F63:F67)","v":1},{"$f":"SUM('Haar Disciples'!G63:G67)","v":1},{"$f":"SUM('Haar Disciples'!H63:H67)","v":0},{"$f":"SUM('Haar Disciples'!I63:I67)","v":0},{"$f":"SUM('Haar Disciples'!J63:J67)","v":0},{"$f":"SUM('Haar Disciples'!K63:K67)","v":0},{"$f":"SUM('Haar Disciples'!L63:L67)","v":1},{"$f":"SUM('Haar Disciples'!M63:M67)","v":1},{"$f":"SUM('Haar Disciples'!N63:N67)","v":0},{"$f":"SUM('Haar Disciples'!O63:O67)","v":0},{"$f":"SUM('Haar Disciples'!P63:P67)","v":0},{"$f":"SUM('Haar Disciples'!Q63:Q67)","v":0},{"$f":"SUM('Haar Disciples'!R63:R67)","v":0},null,{"$f":"SUM('Haar Disciples'!T63:T67)","v":0},{"$f":"SUM('Haar Disciples'!U63:U67)","v":0},{"$f":"SUM('Haar Disciples'!V63:V67)","v":0},null,{"$f":"IF(ISERROR(G51/D51),0,G51/D51)","v":0},{"$f":"IF(ISERROR((4*J51+3*I51+2*H51+G51-SUM(H51:J51))/D51),0,(4*J51+3*I51+2*H51+G51-SUM(H51:J51))/D51)","v":0},{"$f":"W51+X51","v":0},{"$f":"IF(ISERROR((G51+L51+M51)/(D51+L51+M51+Q51)),0,(G51+L51+M51)/(D51+L51+M51+Q51))","v":0.5},{"$f":"Z51+X51","v":0.5},null,{"$f":"IF(ISERROR((S51+T51)/(U51+S51+T51)),0,(S51+T51)/(U51+S51+T51))","v":0}]
[{"$f":"'Haar Disciples'!A68","v":56},{"$f":"IF('Haar Disciples'!B68=\"\",\"\",'Haar Disciples'!B68)","v":"Kuhles"},{"$f":"SUM('Haar Disciples'!D68:D72)","v":1},{"$f":"SUM('Haar Disciples'!E68:E72)","v":1},{"$f":"SUM('Haar Disciples'!F68:F72)","v":0},{"$f":"SUM('Haar Disciples'!G68:G72)","v":0},{"$f":"SUM('Haar Disciples'!H68:H72)","v":0},{"$f":"SUM('Haar Disciples'!I68:I72)","v":0},{"$f":"SUM('Haar Disciples'!J68:J72)","v":0},{"$f":"SUM('Haar Disciples'!K68:K72)","v":0},{"$f":"SUM('Haar Disciples'!L68:L72)","v":1},{"$f":"SUM('Haar Disciples'!M68:M72)","v":1},{"$f":"SUM('Haar Disciples'!N68:N72)","v":0},{"$f":"SUM('Haar Disciples'!O68:O72)","v":0},{"$f":"SUM('Haar Disciples'!P68:P72)","v":0},{"$f":"SUM('Haar Disciples'!Q68:Q72)","v":0},{"$f":"SUM('Haar Disciples'!R68:R72)","v":0},null,{"$f":"SUM('Haar Disciples'!T68:T72)","v":0},{"$f":"SUM('Haar Disciples'!U68:U72)","v":0},{"$f":"SUM('Haar Disciples'!V68:V72)","v":0},null,{"$f":"IF(ISERROR(G52/D52),0,G52/D52)","v":0},{"$f":"IF(ISERROR((4*J52+3*I52+2*H52+G52-SUM(H52:J52))/D52),0,(4*J52+3*I52+2*H52+G52-SUM(H52:J52))/D52)","v":0},{"$f":"W52+X52","v":0},{"$f":"IF(ISERROR((G52+L52+M52)/(D52+L52+M52+Q52)),0,(G52+L52+M52)/(D52+L52+M52+Q52))","v":0.5},{"$f":"Z52+X52","v":0.5},null,{"$f":"IF(ISERROR((S52+T52)/(U52+S52+T52)),0,(S52+T52)/(U52+S52+T52))","v":0}]
[{"$f":"'Neunkirchen Nightmares'!A8","v":68},{"$f":"IF('Neunkirchen Nightmares'!B8=\"\",\"\",'Neunkirchen Nightmares'!B8)","v":"Fischer"},{"$f":"SUM('Neunkirchen Nightmares'!D8:D12)","v":10},{"$f":"SUM('Neunkirchen Nightmares'!E8:E12)","v":6},{"$f":"SUM('Neunkirchen Nightmares'!F8:F12)","v":3},{"$f":"SUM('Neunkirchen Nightmares'!G8:G12)","v":2},{"$f":"SUM('Neunkirchen Nightmares'!H8:H12)","v":0},{"$f":"SUM('Neunkirchen Nightmares'!I8:I12)","v":0},{"$f":"SUM('Neunkirchen Nightmares'!J8:J12)","v":0},{"$f":"SUM('Neunkirchen Nightmares'!K8:K12)","v":0},{"$f":"SUM('Neunkirchen Nightmares'!L8:L12)","v":1},{"$f":"SUM('Neunkirchen Nightmares'!M8:M12)","v":4},{"$f":"SUM('Neunkirchen Nightmares'!N8:N12)","v":0},{"$f":"SUM('Neunkirchen Nightmares'!O8:O12)","v":2},{"$f":"SUM('Neunkirchen Nightmares'!P8:P12)","v":0},{"$f":"SUM('Neunkirchen Nightmares'!Q8:Q12)","v":0},{"$f":"SUM('Neunkirchen Nightmares'!R8:R12)","v":0},null,{"$f":"SUM('Neunkirchen Nightmares'!T8:T12)","v":2},{"$f":"SUM('Neunkirchen Nightmares'!U8:U12)","v":1},{"$f":"SUM('Neunkirchen Nightmares'!V8:V12)","v":1},null,{"$f":"IF(ISERROR(G53/D53),0,G53/D53)","v":0},{"$f":"IF(ISERROR((4*J53+3*I53+2*H53+G53-SUM(H53:J53))/D53),0,(4*J53+3*I53+2*H53+G53-SUM(H53:J53))/D53)","v":0},{"$f":"W53+X53","v":0},{"$f":"IF(ISERROR((G53+L53+M53)/(D53+L53+M53+Q53)),0,(G53+L53+M53)/(D53+L53+M53+Q53))","v":0.4},{"$f":"Z53+X53","v":0.4},null,{"$f":"IF(ISERROR((S53+T53)/(U53+S53+T53)),0,(S53+T53)/(U53+S53+T53))","v":0.75}]
[{"$f":"'Wesseling Vermins'!A53","v":31},{"$f":"IF('Wesseling Vermins'!B53=\"\",\"\",'Wesseling Vermins'!B53)","v":"Erden"},{"$f":"SUM('Wesseling Vermins'!D53:D57)","v":3},{"$f":"SUM('Wesseling Vermins'!E53:E57)","v":2},{"$f":"SUM('Wesseling Vermins'!F53:F57)","v":0},{"$f":"SUM('Wesseling Vermins'!G53:G57)","v":0},{"$f":"SUM('Wesseling Vermins'!H53:H57)","v":0},{"$f":"SUM('Wesseling Vermins'!I53:I57)","v":0},{"$f":"SUM('Wesseling Vermins'!J53:J57)","v":0},{"$f":"SUM('Wesseling Vermins'!K53:K57)","v":0},{"$f":"SUM('Wesseling Vermins'!L53:L57)","v":1},{"$f":"SUM('Wesseling Vermins'!M53:M57)","v":1},{"$f":"SUM('Wesseling Vermins'!N53:N57)","v":0},{"$f":"SUM('Wesseling Vermins'!O53:O57)","v":0},{"$f":"SUM('Wesseling Vermins'!P53:P57)","v":0},{"$f":"SUM('Wesseling Vermins'!Q53:Q57)","v":0},{"$f":"SUM('Wesseling Vermins'!R53:R57)","v":0},null,{"$f":"SUM('Wesseling Vermins'!T53:T57)","v":0},{"$f":"SUM('Wesseling Vermins'!U53:U57)","v":0},{"$f":"SUM('Wesseling Vermins'!V53:V57)","v":0},null,{"$f":"IF(ISERROR(G54/D54),0,G54/D54)","v":0},{"$f":"IF(ISERROR((4*J54+3*I54+2*H54+G54-SUM(H54:J54))/D54),0,(4*J54+3*I54+2*H54+G54-SUM(H54:J54))/D54)","v":0},{"$f":"W54+X54","v":0},{"$f":"IF(ISERROR((G54+L54+M54)/(D54+L54+M54+Q54)),0,(G54+L54+M54)/(D54+L54+M54+Q54))","v":0.33333333333333331},{"$f":"Z54+X54","v":0.33333333333333331},null,{"$f":"IF(ISERROR((S54+T54)/(U54+S54+T54)),0,(S54+T54)/(U54+S54+T54))","v":0}]
[{"$f":"'Freising Grizzlies'!A8","v":33},{"$f":"IF('Freising Grizzlies'!B8=\"\",\"\",'Freising Grizzlies'!B8)","v":"Eschke"},{"$f":"SUM('Freising Grizzlies'!D8:D12)","v":3},{"$f":"SUM('Freising Grizzlies'!E8:E12)","v":2},{"$f":"SUM('Freising Grizzlies'!F8:F12)","v":0},{"$f":"SUM('Freising Grizzlies'!G8:G12)","v":0},{"$f":"SUM('Freising Grizzlies'!H8:H12)","v":0},{"$f":"SUM('Freising Grizzlies'!I8:I12)","v":0},{"$f":"SUM('Freising Grizzlies'!J8:J12)","v":0},{"$f":"SUM('Freising Grizzlies'!K8:K12)","v":0},{"$f":"SUM('Freising Grizzlies'!L8:L12)","v":2},{"$f":"SUM('Freising Grizzlies'!M8:M12)","v":1},{"$f":"SUM('Freising Grizzlies'!N8:N12)","v":0},{"$f":"SUM('Freising Grizzlies'!O8:O12)","v":0},{"$f":"SUM('Freising Grizzlies'!P8:P12)","v":0},{"$f":"SUM('Freising Grizzlies'!Q8:Q12)","v":0},{"$f":"SUM('Freising Grizzlies'!R8:R12)","v":0},null,{"$f":"SUM('Freising Grizzlies'!T8:T12)","v":0},{"$f":"SUM('Freising Grizzlies'!U8:U12)","v":0},{"$f":"SUM('Freising Grizzlies'!V8:V12)","v":0},null,{"$f":"IF(ISERROR(G55/D55),0,G55/D55)","v":0},{"$f":"IF(ISERROR((4*J55+3*I55+2*H55+G55-SUM(H55:J55))/D55),0,(4*J55+3*I55+2*H55+G55-SUM(H55:J55))/D55)","v":0},{"$f":"W55+X55","v":0},{"$f":"IF(ISERROR((G55+L55+M55)/(D55+L55+M55+Q55)),0,(G55+L55+M55)/(D55+L55+M55+Q55))","v":0.33333333333333331},{"$f":"Z55+X55","v":0.33333333333333331},null,{"$f":"IF(ISERROR((S55+T55)/(U55+S55+T55)),0,(S55+T55)/(U55+S55+T55))","v":0}]
[{"$f":"'Haar Disciples'!A58","v":54},{"$f":"IF('Haar Disciples'!B58=\"\",\"\",'Haar Disciples'!B58)","v":"Knallhuber"},{"$f":"SUM('Haar Disciples'!D58:D62)","v":4},{"$f":"SUM('Haar Disciples'!E58:E62)","v":3},{"$f":"SUM('Haar Disciples'!F58:F62)","v":0},{"$f":"SUM('Haar Disciples'!G58:G62)","v":0},{"$f":"SUM('Haar Disciples'!H58:H62)","v":0},{"$f":"SUM('Haar Disciples'!I58:I62)","v":0},{"$f":"SUM('Haar Disciples'!J58:J62)","v":0},{"$f":"SUM('Haar Disciples'!K58:K62)","v":0},{"$f":"SUM('Haar Disciples'!L58:L62)","v":2},{"$f":"SUM('Haar Disciples'!M58:M62)","v":0},{"$f":"SUM('Haar Disciples'!N58:N62)","v":1},{"$f":"SUM('Haar Disciples'!O58:O62)","v":0},{"$f":"SUM('Haar Disciples'!P58:P62)","v":0},{"$f":"SUM('Haar Disciples'!Q58:Q62)","v":0},{"$f":"SUM('Haar Disciples'!R58:R62)","v":0},null,{"$f":"SUM('Haar Disciples'!T58:T62)","v":0},{"$f":"SUM('Haar Disciples'!U58:U62)","v":0},{"$f":"SUM('Haar Disciples'!V58:V62)","v":0},null,{"$f":"IF(ISERROR(G56/D56),0,G56/D56)","v":0},{"$f":"IF(ISERROR((4*J56+3*I56+2*H56+G56-SUM(H56:J56))/D56),0,(4*J56+3*I56+2*H56+G56-SUM(H56:J56))/D56)","v":0},{"$f":"W56+X56","v":0},{"$f":"IF(ISERROR((G56+L56+M56)/(D56+L56+M56+Q56)),0,(G56+L56+M56)/(D56+L56+M56+Q56))","v":0.25},{"$f":"Z56+X56","v":0.25},null,{"$f":"IF(ISERROR((S56+T56)/(U56+S56+T56)),0,(S56+T56)/(U56+S56+T56))","v":0}]
[{"$f":"'Wesseling Vermins'!A28","v":26},{"$f":"IF('Wesseling Vermins'!B28=\"\",\"\",'Wesseling Vermins'!B28)","v":"Reisenauer"},{"$f":"SUM('Wesseling Vermins'!D28:D32)","v":12},{"$f":"SUM('Wesseling Vermins'!E28:E32)","v":9},{"$f":"SUM('Wesseling Vermins'!F28:F32)","v":1},{"$f":"SUM('Wesseling Vermins'!G28:G32)","v":4},{"$f":"SUM('Wesseling Vermins'!H28:H32)","v":1},{"$f":"SUM('Wesseling Vermins'!I28:I32)","v":0},{"$f":"SUM('Wesseling Vermins'!J28:J32)","v":0},{"$f":"SUM('Wesseling Vermins'!K28:K32)","v":0},{"$f":"SUM('Wesseling Vermins'!L28:L32)","v":2},{"$f":"SUM('Wesseling Vermins'!M28:M32)","v":1},{"$f":"SUM('Wesseling Vermins'!N28:N32)","v":0},{"$f":"SUM('Wesseling Vermins'!O28:O32)","v":0},{"$f":"SUM('Wesseling Vermins'!P28:P32)","v":0},{"$f":"SUM('Wesseling Vermins'!Q28:Q32)","v":2},{"$f":"SUM('Wesseling Vermins'!R28:R32)","v":0},null,{"$f":"SUM('Wesseling Vermins'!T28:T32)","v":9},{"$f":"SUM('Wesseling Vermins'!U28:U32)","v":3},{"$f":"SUM('Wesseling Vermins'!V28:V32)","v":0},null,{"$f":"IF(ISERROR(G57/D57),0,G57/D57)","v":0.1111111111111111},{"$f":"IF(ISERROR((4*J57+3*I57+2*H57+G57-SUM(H57:J57))/D57),0,(4*J57+3*I57+2*H57+G57-SUM(H57:J57))/D57)","v":0.1111111111111111},{"$f":"W57+X57","v":0.22222222222222221},{"$f":"IF(ISERROR((G57+L57+M57)/(D57+L57+M57+Q57)),0,(G57+L57+M57)/(D57+L57+M57+Q57))","v":0.2},{"$f":"Z57+X57","v":0.31111111111111112},null,{"$f":"IF(ISERROR((S57+T57)/(U57+S57+T57)),0,(S57+T57)/(U57+S57+T57))","v":1}]
[{"$f":"'Karlsruhe Cougars'!A28","v":62},{"$f":"IF('Karlsruhe Cougars'!B28=\"\",\"\",'Karlsruhe Cougars'!B28)","v":"Malmbeck"},{"$f":"SUM('Karlsruhe Cougars'!D28:D32)","v":10},{"$f":"SUM('Karlsruhe Cougars'!E28:E32)","v":7},{"$f":"SUM('Karlsruhe Cougars'!F28:F32)","v":2},{"$f":"SUM('Karlsruhe Cougars'!G28:G32)","v":1},{"$f":"SUM('Karlsruhe Cougars'!H28:H32)","v":0},{"$f":"SUM('Karlsruhe Cougars'!I28:I32)","v":0},{"$f":"SUM('Karlsruhe Cougars'!J28:J32)","v":0},{"$f":"SUM('Karlsruhe Cougars'!K28:K32)","v":0},{"$f":"SUM('Karlsruhe Cougars'!L28:L32)","v":3},{"$f":"SUM('Karlsruhe Cougars'!M28:M32)","v":2},{"$f":"SUM('Karlsruhe Cougars'!N28:N32)","v":1},{"$f":"SUM('Karlsruhe Cougars'!O28:O32)","v":0},{"$f":"SUM('Karlsruhe Cougars'!P28:P32)","v":0},{"$f":"SUM('Karlsruhe Cougars'!Q28:Q32)","v":0},{"$f":"SUM('Karlsruhe Cougars'!R28:R32)","v":0},null,{"$f":"SUM('Karlsruhe Cougars'!T28:T32)","v":2},{"$f":"SUM('Karlsruhe Cougars'!U28:U32)","v":0},{"$f":"SUM('Karlsruhe Cougars'!V28:V32)","v":0},null,{"$f":"IF(ISERROR(G58/D58),0,G58/D58)","v":0},{"$f":"IF(ISERROR((4*J58+3*I58+2*H58+G58-SUM(H58:J58))/D58),0,(4*J58+3*I58+2*H58+G58-SUM(H58:J58))/D58)","v":0},{"$f":"W58+X58","v":0},{"$f":"IF(ISERROR((G58+L58+M58)/(D58+L58+M58+Q58)),0,(G58+L58+M58)/(D58+L58+M58+Q58))","v":0.3},{"$f":"Z58+X58","v":0.3},null,{"$f":"IF(ISERROR((S58+T58)/(U58+S58+T58)),0,(S58+T58)/(U58+S58+T58))","v":1}]
[{"$f":"'Karlsruhe Cougars'!A23","v":61},{"$f":"IF('Karlsruhe Cougars'!B23=\"\",\"\",'Karlsruhe Cougars'!B23)","v":"Sturm"},{"$f":"SUM('Karlsruhe Cougars'!D23:D27)","v":10},{"$f":"SUM('Karlsruhe Cougars'!E23:E27)","v":7},{"$f":"SUM('Karlsruhe Cougars'!F23:F27)","v":2},{"$f":"SUM('Karlsruhe Cougars'!G23:G27)","v":1},{"$f":"SUM('Karlsruhe Cougars'!H23:H27)","v":0},{"$f":"SUM('Karlsruhe Cougars'!I23:I27)","v":0},{"$f":"SUM('Karlsruhe Cougars'!J23:J27)","v":0},{"$f":"SUM('Karlsruhe Cougars'!K23:K27)","v":0},{"$f":"SUM('Karlsruhe Cougars'!L23:L27)","v":1},{"$f":"SUM('Karlsruhe Cougars'!M23:M27)","v":3},{"$f":"SUM('Karlsruhe Cougars'!N23:N27)","v":0},{"$f":"SUM('Karlsruhe Cougars'!O23:O27)","v":0},{"$f":"SUM('Karlsruhe Cougars'!P23:P27)","v":0},{"$f":"SUM('Karlsruhe Cougars'!Q23:Q27)","v":0},{"$f":"SUM('Karlsruhe Cougars'!R23:R27)","v":0},null,{"$f":"SUM('Karlsruhe Cougars'!T23:T27)","v":3},{"$f":"SUM('Karlsruhe Cougars'!U23:U27)","v":4},{"$f":"SUM('Karlsruhe Cougars'!V23:V27)","v":1},null,{"$f":"IF(ISERROR(G59/D59),0,G59/D59)","v":0},{"$f":"IF(ISERROR((4*J59+3*I59+2*H59+G59-SUM(H59:J59))/D59),0,(4*J59+3*I59+2*H59+G59-SUM(H59:J59))/D59)","v":0},{"$f":"W59+X59","v":0},{"$f":"IF(ISERROR((G59+L59+M59)/(D59+L59+M59+Q59)),0,(G59+L59+M59)/(D59+L59+M59+Q59))","v":0.3},{"$f":"Z59+X59","v":0.3},null,{"$f":"IF(ISERROR((S59+T59)/(U59+S59+T59)),0,(S59+T59)/(U59+S59+T59))","v":0.875}]
[{"$f":"'Wesseling Vermins'!A8","v":22},{"$f":"IF('Wesseling Vermins'!B8=\"\",\"\",'Wesseling Vermins'!B8)","v":"Schlitzer"},{"$f":"SUM('Wesseling Vermins'!D8:D12)","v":12},{"$f":"SUM('Wesseling Vermins'!E8:E12)","v":10},{"$f":"SUM('Wesseling Vermins'!F8:F12)","v":3},{"$f":"SUM('Wesseling Vermins'!G8:G12)","v":3},{"$f":"SUM('Wesseling Vermins'!H8:H12)","v":1},{"$f":"SUM('Wesseling Vermins'!I8:I12)","v":0},{"$f":"SUM('Wesseling Vermins'!J8:J12)","v":0},{"$f":"SUM('Wesseling Vermins'!K8:K12)","v":0},{"$f":"SUM('Wesseling Vermins'!L8:L12)","v":0},{"$f":"SUM('Wesseling Vermins'!M8:M12)","v":1},{"$f":"SUM('Wesseling Vermins'!N8:N12)","v":0},{"$f":"SUM('Wesseling Vermins'!O8:O12)","v":2},{"$f":"SUM('Wesseling Vermins'!P8:P12)","v":0},{"$f":"SUM('Wesseling Vermins'!Q8:Q12)","v":1},{"$f":"SUM('Wesseling Vermins'!R8:R12)","v":0},null,{"$f":"SUM('Wesseling Vermins'!T8:T12)","v":4},{"$f":"SUM('Wesseling Vermins'!U8:U12)","v":1},{"$f":"SUM('Wesseling Vermins'!V8:V12)","v":6},null,{"$f":"IF(ISERROR(G60/D60),0,G60/D60)","v":0.1},{"$f":"IF(ISERROR((4*J60+3*I60+2*H60+G60-SUM(H60:J60))/D60),0,(4*J60+3*I60+2*H60+G60-SUM(H60:J60))/D60)","v":0.1},{"$f":"W60+X60","v":0.2},{"$f":"IF(ISERROR((G60+L60+M60)/(D60+L60+M60+Q60)),0,(G60+L60+M60)/(D60+L60+M60+Q60))","v":0.18181818181818182},{"$f":"Z60+X60","v":0.28181818181818186},null,{"$f":"IF(ISERROR((S60+T60)/(U60+S60+T60)),0,(S60+T60)/(U60+S60+T60))","v":0.45454545454545453}]
[{"$f":"'Haar Disciples'!A28","v":48},{"$f":"IF('Haar Disciples'!B28=\"\",\"\",'Haar Disciples'!B28)","v":"Wiele"},{"$f":"SUM('Haar Disciples'!D28:D32)","v":15},{"$f":"SUM('Haar Disciples'!E28:E32)","v":13},{"$f":"SUM('Haar Disciples'!F28:F32)","v":2},{"$f":"SUM('Haar Disciples'!G28:G32)","v":1},{"$f":"SUM('Haar Disciples'!H28:H32)","v":2},{"$f":"SUM('Haar Disciples'!I28:I32)","v":0},{"$f":"SUM('Haar Disciples'!J28:J32)","v":0},{"$f":"SUM('Haar Disciples'!K28:K32)","v":0},{"$f":"SUM('Haar Disciples'!L28:L32)","v":4},{"$f":"SUM('Haar Disciples'!M28:M32)","v":1},{"$f":"SUM('Haar Disciples'!N28:N32)","v":0},{"$f":"SUM('Haar Disciples'!O28:O32)","v":1},{"$f":"SUM('Haar Disciples'!P28:P32)","v":0},{"$f":"SUM('Haar Disciples'!Q28:Q32)","v":1},{"$f":"SUM('Haar Disciples'!R28:R32)","v":0},null,{"$f":"SUM('Haar Disciples'!T28:T32)","v":0},{"$f":"SUM('Haar Disciples'!U28:U32)","v":0},{"$f":"SUM('Haar Disciples'!V28:V32)","v":0},null,{"$f":"IF(ISERROR(G61/D61),0,G61/D61)","v":0.15384615384615385},{"$f":"IF(ISERROR((4*J61+3*I61+2*H61+G61-SUM(H61:J61))/D61),0,(4*J61+3*I61+2*H61+G61-SUM(H61:J61))/D61)","v":0.15384615384615385},{"$f":"W61+X61","v":0.30769230769230771},{"$f":"IF(ISERROR((G61+L61+M61)/(D61+L61+M61+Q61)),0,(G61+L61+M61)/(D61+L61+M61+Q61))","v":0.21428571428571427},{"$f":"Z61+X61","v":0.36813186813186816},null,{"$f":"IF(ISERROR((S61+T61)/(U61+S61+T61)),0,(S61+T61)/(U61+S61+T61))","v":0}]
[{"$f":"'Hamburg Knights'!A23","v":5},{"$f":"IF('Hamburg Knights'!B23=\"\",\"\",'Hamburg Knights'!B23)","v":"Brunzel"},{"$f":"SUM('Hamburg Knights'!D23:D27)","v":4},{"$f":"SUM('Hamburg Knights'!E23:E27)","v":3},{"$f":"SUM('Hamburg Knights'!F23:F27)","v":1},{"$f":"SUM('Hamburg Knights'!G23:G27)","v":0},{"$f":"SUM('Hamburg Knights'!H23:H27)","v":0},{"$f":"SUM('Hamburg Knights'!I23:I27)","v":0},{"$f":"SUM('Hamburg Knights'!J23:J27)","v":0},{"$f":"SUM('Hamburg Knights'!K23:K27)","v":0},{"$f":"SUM('Hamburg Knights'!L23:L27)","v":2},{"$f":"SUM('Hamburg Knights'!M23:M27)","v":0},{"$f":"SUM('Hamburg Knights'!N23:N27)","v":1},{"$f":"SUM('Hamburg Knights'!O23:O27)","v":1},{"$f":"SUM('Hamburg Knights'!P23:P27)","v":0},{"$f":"SUM('Hamburg Knights'!Q23:Q27)","v":0},{"$f":"SUM('Hamburg Knights'!R23:R27)","v":0},null,{"$f":"SUM('Hamburg Knights'!T23:T27)","v":1},{"$f":"SUM('Hamburg Knights'!U23:U27)","v":2},{"$f":"SUM('Hamburg Knights'!V23:V27)","v":0},null,{"$f":"IF(ISERROR(G62/D62),0,G62/D62)","v":0},{"$f":"IF(ISERROR((4*J62+3*I62+2*H62+G62-SUM(H62:J62))/D62),0,(4*J62+3*I62+2*H62+G62-SUM(H62:J62))/D62)","v":0},{"$f":"W62+X62","v":0},{"$f":"IF(ISERROR((G62+L62+M62)/(D62+L62+M62+Q62)),0,(G62+L62+M62)/(D62+L62+M62+Q62))","v":0.25},{"$f":"Z62+X62","v":0.25},null,{"$f":"IF(ISERROR((S62+T62)/(U62+S62+T62)),0,(S62+T62)/(U62+S62+T62))","v":1}]
[{"$f":"'Wesseling Vermins'!A33","v":27},{"$f":"IF('Wesseling Vermins'!B33=\"\",\"\",'Wesseling Vermins'!B33)","v":"Ziegler"},{"$f":"SUM('Wesseling Vermins'!D33:D37)","v":11},{"$f":"SUM('Wesseling Vermins'!E33:E37)","v":9},{"$f":"SUM('Wesseling Vermins'!F33:F37)","v":1},{"$f":"SUM('Wesseling Vermins'!G33:G37)","v":0},{"$f":"SUM('Wesseling Vermins'!H33:H37)","v":0},{"$f":"SUM('Wesseling Vermins'!I33:I37)","v":0},{"$f":"SUM('Wesseling Vermins'!J33:J37)","v":0},{"$f":"SUM('Wesseling Vermins'!K33:K37)","v":0},{"$f":"SUM('Wesseling Vermins'!L33:L37)","v":5},{"$f":"SUM('Wesseling Vermins'!M33:M37)","v":2},{"$f":"SUM('Wesseling Vermins'!N33:N37)","v":0},{"$f":"SUM('Wesseling Vermins'!O33:O37)","v":0},{"$f":"SUM('Wesseling Vermins'!P33:P37)","v":0},{"$f":"SUM('Wesseling Vermins'!Q33:Q37)","v":0},{"$f":"SUM('Wesseling Vermins'!R33:R37)","v":0},null,{"$f":"SUM('Wesseling Vermins'!T33:T37)","v":0},{"$f":"SUM('Wesseling Vermins'!U33:U37)","v":0},{"$f":"SUM('Wesseling Vermins'!V33:V37)","v":0},null,{"$f":"IF(ISERROR(G63/D63),0,G63/D63)","v":0},{"$f":"IF(ISERROR((4*J63+3*I63+2*H63+G63-SUM(H63:J63))/D63),0,(4*J63+3*I63+2*H63+G63-SUM(H63:J63))/D63)","v":0},{"$f":"W63+X63","v":0},{"$f":"IF(ISERROR((G63+L63+M63)/(D63+L63+M63+Q63)),0,(G63+L63+M63)/(D63+L63+M63+Q63))","v":0.18181818181818182},{"$f":"Z63+X63","v":0.18181818181818182},null,{"$f":"IF(ISERROR((S63+T63)/(U63+S63+T63)),0,(S63+T63)/(U63+S63+T63))","v":0}]
[{"$f":"'Wesseling Vermins'!A13","v":23},{"$f":"IF('Wesseling Vermins'!B13=\"\",\"\",'Wesseling Vermins'!B13)","v":"Seitz"},{"$f":"SUM('Wesseling Vermins'!D13:D17)","v":11},{"$f":"SUM('Wesseling Vermins'!E13:E17)","v":8},{"$f":"SUM('Wesseling Vermins'!F13:F17)","v":2},{"$f":"SUM('Wesseling Vermins'!G13:G17)","v":3},{"$f":"SUM('Wesseling Vermins'!H13:H17)","v":0},{"$f":"SUM('Wesseling Vermins'!I13:I17)","v":0},{"$f":"SUM('Wesseling Vermins'!J13:J17)","v":0},{"$f":"SUM('Wesseling Vermins'!K13:K17)","v":0},{"$f":"SUM('Wesseling Vermins'!L13:L17)","v":1},{"$f":"SUM('Wesseling Vermins'!M13:M17)","v":1},{"$f":"SUM('Wesseling Vermins'!N13:N17)","v":0},{"$f":"SUM('Wesseling Vermins'!O13:O17)","v":0},{"$f":"SUM('Wesseling Vermins'!P13:P17)","v":0},{"$f":"SUM('Wesseling Vermins'!Q13:Q17)","v":2},{"$f":"SUM('Wesseling Vermins'!R13:R17)","v":0},null,{"$f":"SUM('Wesseling Vermins'!T13:T17)","v":0},{"$f":"SUM('Wesseling Vermins'!U13:U17)","v":0},{"$f":"SUM('Wesseling Vermins'!V13:V17)","v":0},null,{"$f":"IF(ISERROR(G64/D64),0,G64/D64)","v":0},{"$f":"IF(ISERROR((4*J64+3*I64+2*H64+G64-SUM(H64:J64))/D64),0,(4*J64+3*I64+2*H64+G64-SUM(H64:J64))/D64)","v":0},{"$f":"W64+X64","v":0},{"$f":"IF(ISERROR((G64+L64+M64)/(D64+L64+M64+Q64)),0,(G64+L64+M64)/(D64+L64+M64+Q64))","v":0.1111111111111111},{"$f":"Z64+X64","v":0.1111111111111111},null,{"$f":"IF(ISERROR((S64+T64)/(U64+S64+T64)),0,(S64+T64)/(U64+S64+T64))","v":0}]
[{"$f":"'Hamburg Knights'!A8","v":2},{"$f":"IF('Hamburg Knights'!B8=\"\",\"\",'Hamburg Knights'!B8)","v":"Strohm"},{"$f":"SUM('Hamburg Knights'!D8:D12)","v":4},{"$f":"SUM('Hamburg Knights'!E8:E12)","v":4},{"$f":"SUM('Hamburg Knights'!F8:F12)","v":1},{"$f":"SUM('Hamburg Knights'!G8:G12)","v":1},{"$f":"SUM('Hamburg Knights'!H8:H12)","v":0},{"$f":"SUM('Hamburg Knights'!I8:I12)","v":0},{"$f":"SUM('Hamburg Knights'!J8:J12)","v":0},{"$f":"SUM('Hamburg Knights'!K8:K12)","v":0},{"$f":"SUM('Hamburg Knights'!L8:L12)","v":1},{"$f":"SUM('Hamburg Knights'!M8:M12)","v":0},{"$f":"SUM('Hamburg Knights'!N8:N12)","v":0},{"$f":"SUM('Hamburg Knights'!O8:O12)","v":0},{"$f":"SUM('Hamburg Knights'!P8:P12)","v":0},{"$f":"SUM('Hamburg Knights'!Q8:Q12)","v":0},{"$f":"SUM('Hamburg Knights'!R8:R12)","v":0},null,{"$f":"SUM('Hamburg Knights'!T8:T12)","v":0},{"$f":"SUM('Hamburg Knights'!U8:U12)","v":2},{"$f":"SUM('Hamburg Knights'!V8:V12)","v":3},null,{"$f":"IF(ISERROR(G65/D65),0,G65/D65)","v":0},{"$f":"IF(ISERROR((4*J65+3*I65+2*H65+G65-SUM(H65:J65))/D65),0,(4*J65+3*I65+2*H65+G65-SUM(H65:J65))/D65)","v":0},{"$f":"W65+X65","v":0},{"$f":"IF(ISERROR((G65+L65+M65)/(D65+L65+M65+Q65)),0,(G65+L65+M65)/(D65+L65+M65+Q65))","v":0},{"$f":"Z65+X65","v":0},null,{"$f":"IF(ISERROR((S65+T65)/(U65+S65+T65)),0,(S65+T65)/(U65+S65+T65))","v":0.4}]
[{"$f":"'Hamburg Knights'!A28","v":6},{"$f":"IF('Hamburg Knights'!B28=\"\",\"\",'Hamburg Knights'!B28)","v":"Wittkugel"},{"$f":"SUM('Hamburg Knights'!D28:D32)","v":3},{"$f":"SUM('Hamburg Knights'!E28:E32)","v":3},{"$f":"SUM('Hamburg Knights'!F28:F32)","v":1},{"$f":"SUM('Hamburg Knights'!G28:G32)","v":0},{"$f":"SUM('Hamburg Knights'!H28:H32)","v":0},{"$f":"SUM('Hamburg Knights'!I28:I32)","v":0},{"$f":"SUM('Hamburg Knights'!J28:J32)","v":0},{"$f":"SUM('Hamburg Knights'!K28:K32)","v":0},{"$f":"SUM('Hamburg Knights'!L28:L32)","v":1},{"$f":"SUM('Hamburg Knights'!M28:M32)","v":0},{"$f":"SUM('Hamburg Knights'!N28:N32)","v":0},{"$f":"SUM('Hamburg Knights'!O28:O32)","v":1},{"$f":"SUM('Hamburg Knights'!P28:P32)","v":0},{"$f":"SUM('Hamburg Knights'!Q28:Q32)","v":0},{"$f":"SUM('Hamburg Knights'!R28:R32)","v":0},null,{"$f":"SUM('Hamburg Knights'!T28:T32)","v":0},{"$f":"SUM('Hamburg Knights'!U28:U32)","v":1},{"$f":"SUM('Hamburg Knights'!V28:V32)","v":0},null,{"$f":"IF(ISERROR(G66/D66),0,G66/D66)","v":0},{"$f":"IF(ISERROR((4*J66+3*I66+2*H66+G66-SUM(H66:J66))/D66),0,(4*J66+3*I66+2*H66+G66-SUM(H66:J66))/D66)","v":0},{"$f":"W66+X66","v":0},{"$f":"IF(ISERROR((G66+L66+M66)/(D66+L66+M66+Q66)),0,(G66+L66+M66)/(D66+L66+M66+Q66))","v":0},{"$f":"Z66+X66","v":0},null,{"$f":"IF(ISERROR((S66+T66)/(U66+S66+T66)),0,(S66+T66)/(U66+S66+T66))","v":1}]
[{"$f":"'Hamburg Knights'!A33","v":7},{"$f":"IF('Hamburg Knights'!B33=\"\",\"\",'Hamburg Knights'!B33)","v":"Bünnerstede"},{"$f":"SUM('Hamburg Knights'!D33:D37)","v":3},{"$f":"SUM('Hamburg Knights'!E33:E37)","v":3},{"$f":"SUM('Hamburg Knights'!F33:F37)","v":1},{"$f":"SUM('Hamburg Knights'!G33:G37)","v":0},{"$f":"SUM('Hamburg Knights'!H33:H37)","v":0},{"$f":"SUM('Hamburg Knights'!I33:I37)","v":0},{"$f":"SUM('Hamburg Knights'!J33:J37)","v":0},{"$f":"SUM('Hamburg Knights'!K33:K37)","v":0},{"$f":"SUM('Hamburg Knights'!L33:L37)","v":1},{"$f":"SUM('Hamburg Knights'!M33:M37)","v":0},{"$f":"SUM('Hamburg Knights'!N33:N37)","v":0},{"$f":"SUM('Hamburg Knights'!O33:O37)","v":0},{"$f":"SUM('Hamburg Knights'!P33:P37)","v":0},{"$f":"SUM('Hamburg Knights'!Q33:Q37)","v":0},{"$f":"SUM('Hamburg Knights'!R33:R37)","v":0},null,{"$f":"SUM('Hamburg Knights'!T33:T37)","v":0},{"$f":"SUM('Hamburg Knights'!U33:U37)","v":2},{"$f":"SUM('Hamburg Knights'!V33:V37)","v":0},null,{"$f":"IF(ISERROR(G67/D67),0,G67/D67)","v":0},{"$f":"IF(ISERROR((4*J67+3*I67+2*H67+G67-SUM(H67:J67))/D67),0,(4*J67+3*I67+2*H67+G67-SUM(H67:J67))/D67)","v":0},{"$f":"W67+X67","v":0},{"$f":"IF(ISERROR((G67+L67+M67)/(D67+L67+M67+Q67)),0,(G67+L67+M67)/(D67+L67+M67+Q67))","v":0},{"$f":"Z67+X67","v":0},null,{"$f":"IF(ISERROR((S67+T67)/(U67+S67+T67)),0,(S67+T67)/(U67+S67+T67))","v":1}]
[{"$f":"'Hamburg Knights'!A3","v":1},{"$f":"IF('Hamburg Knights'!B3=\"\",\"\",'Hamburg Knights'!B3)","v":"Bertonasco"},{"$f":"SUM('Hamburg Knights'!D3:D7)","v":3},{"$f":"SUM('Hamburg Knights'!E3:E7)","v":3},{"$f":"SUM('Hamburg Knights'!F3:F7)","v":0},{"$f":"SUM('Hamburg Knights'!G3:G7)","v":0},{"$f":"SUM('Hamburg Knights'!H3:H7)","v":0},{"$f":"SUM('Hamburg Knights'!I3:I7)","v":0},{"$f":"SUM('Hamburg Knights'!J3:J7)","v":0},{"$f":"SUM('Hamburg Knights'!K3:K7)","v":0},{"$f":"SUM('Hamburg Knights'!L3:L7)","v":3},{"$f":"SUM('Hamburg Knights'!M3:M7)","v":0},{"$f":"SUM('Hamburg Knights'!N3:N7)","v":0},{"$f":"SUM('Hamburg Knights'!O3:O7)","v":0},{"$f":"SUM('Hamburg Knights'!P3:P7)","v":0},{"$f":"SUM('Hamburg Knights'!Q3:Q7)","v":0},{"$f":"SUM('Hamburg Knights'!R3:R7)","v":0},null,{"$f":"SUM('Hamburg Knights'!T3:T7)","v":2},{"$f":"SUM('Hamburg Knights'!U3:U7)","v":0},{"$f":"SUM('Hamburg Knights'!V3:V7)","v":1},null,{"$f":"IF(ISERROR(G68/D68),0,G68/D68)","v":0},{"$f":"IF(ISERROR((4*J68+3*I68+2*H68+G68-SUM(H68:J68))/D68),0,(4*J68+3*I68+2*H68+G68-SUM(H68:J68))/D68)","v":0},{"$f":"W68+X68","v":0},{"$f":"IF(ISERROR((G68+L68+M68)/(D68+L68+M68+Q68)),0,(G68+L68+M68)/(D68+L68+M68+Q68))","v":0},{"$f":"Z68+X68","v":0},null,{"$f":"IF(ISERROR((S68+T68)/(U68+S68+T68)),0,(S68+T68)/(U68+S68+T68))","v":0.66666666666666663}]
[{"$f":"'Knights 2'!A8","v":19},{"$f":"IF('Knights 2'!B8=\"\",\"\",'Knights 2'!B8)","v":"Ottenberg"},{"$f":"SUM('Knights 2'!D8:D12)","v":2},{"$f":"SUM('Knights 2'!E8:E12)","v":2},{"$f":"SUM('Knights 2'!F8:F12)","v":1},{"$f":"SUM('Knights 2'!G8:G12)","v":0},{"$f":"SUM('Knights 2'!H8:H12)","v":0},{"$f":"SUM('Knights 2'!I8:I12)","v":0},{"$f":"SUM('Knights 2'!J8:J12)","v":0},{"$f":"SUM('Knights 2'!K8:K12)","v":0},{"$f":"SUM('Knights 2'!L8:L12)","v":0},{"$f":"SUM('Knights 2'!M8:M12)","v":0},{"$f":"SUM('Knights 2'!N8:N12)","v":0},{"$f":"SUM('Knights 2'!O8:O12)","v":0},{"$f":"SUM('Knights 2'!P8:P12)","v":0},{"$f":"SUM('Knights 2'!Q8:Q12)","v":0},{"$f":"SUM('Knights 2'!R8:R12)","v":0},null,{"$f":"SUM('Knights 2'!T8:T12)","v":0},{"$f":"SUM('Knights 2'!U8:U12)","v":1},{"$f":"SUM('Knights 2'!V8:V12)","v":0},null,{"$f":"IF(ISERROR(G69/D69),0,G69/D69)","v":0},{"$f":"IF(ISERROR((4*J69+3*I69+2*H69+G69-SUM(H69:J69))/D69),0,(4*J69+3*I69+2*H69+G69-SUM(H69:J69))/D69)","v":0},{"$f":"W69+X69","v":0},{"$f":"IF(ISERROR((G69+L69+M69)/(D69+L69+M69+Q69)),0,(G69+L69+M69)/(D69+L69+M69+Q69))","v":0},{"$f":"Z69+X69","v":0},null,{"$f":"IF(ISERROR((S69+T69)/(U69+S69+T69)),0,(S69+T69)/(U69+S69+T69))","v":1}]
[{"$f":"'Haar Disciples'!A53","v":53},{"$f":"IF('Haar Disciples'!B53=\"\",\"\",'Haar Disciples'!B53)","v":"Gomilschak"},{"$f":"SUM('Haar Disciples'!D53:D57)","v":2},{"$f":"SUM('Haar Disciples'!E53:E57)","v":2},{"$f":"SUM('Haar Disciples'!F53:F57)","v":0},{"$f":"SUM('Haar Disciples'!G53:G57)","v":0},{"$f":"SUM('Haar Disciples'!H53:H57)","v":0},{"$f":"SUM('Haar Disciples'!I53:I57)","v":0},{"$f":"SUM('Haar Disciples'!J53:J57)","v":0},{"$f":"SUM('Haar Disciples'!K53:K57)","v":0},{"$f":"SUM('Haar Disciples'!L53:L57)","v":1},{"$f":"SUM('Haar Disciples'!M53:M57)","v":0},{"$f":"SUM('Haar Disciples'!N53:N57)","v":0},{"$f":"SUM('Haar Disciples'!O53:O57)","v":0},{"$f":"SUM('Haar Disciples'!P53:P57)","v":0},{"$f":"SUM('Haar Disciples'!Q53:Q57)","v":0},{"$f":"SUM('Haar Disciples'!R53:R57)","v":0},null,{"$f":"SUM('Haar Disciples'!T53:T57)","v":0},{"$f":"SUM('Haar Disciples'!U53:U57)","v":1},{"$f":"SUM('Haar Disciples'!V53:V57)","v":1},null,{"$f":"IF(ISERROR(G70/D70),0,G70/D70)","v":0},{"$f":"IF(ISERROR((4*J70+3*I70+2*H70+G70-SUM(H70:J70))/D70),0,(4*J70+3*I70+2*H70+G70-SUM(H70:J70))/D70)","v":0},{"$f":"W70+X70","v":0},{"$f":"IF(ISERROR((G70+L70+M70)/(D70+L70+M70+Q70)),0,(G70+L70+M70)/(D70+L70+M70+Q70))","v":0},{"$f":"Z70+X70","v":0},null,{"$f":"IF(ISERROR((S70+T70)/(U70+S70+T70)),0,(S70+T70)/(U70+S70+T70))","v":0.5}]
[{"$f":"'Hamburg Knights'!A48","v":10},{"$f":"IF('Hamburg Knights'!B48=\"\",\"\",'Hamburg Knights'!B48)","v":"Herrmann"},{"$f":"SUM('Hamburg Knights'!D48:D52)","v":1},{"$f":"SUM('Hamburg Knights'!E48:E52)","v":1},{"$f":"SUM('Hamburg Knights'!F48:F52)","v":0},{"$f":"SUM('Hamburg Knights'!G48:G52)","v":0},{"$f":"SUM('Hamburg Knights'!H48:H52)","v":0},{"$f":"SUM('Hamburg Knights'!I48:I52)","v":0},{"$f":"SUM('Hamburg Knights'!J48:J52)","v":0},{"$f":"SUM('Hamburg Knights'!K48:K52)","v":0},{"$f":"SUM('Hamburg Knights'!L48:L52)","v":0},{"$f":"SUM('Hamburg Knights'!M48:M52)","v":0},{"$f":"SUM('Hamburg Knights'!N48:N52)","v":0},{"$f":"SUM('Hamburg Knights'!O48:O52)","v":0},{"$f":"SUM('Hamburg Knights'!P48:P52)","v":0},{"$f":"SUM('Hamburg Knights'!Q48:Q52)","v":0},{"$f":"SUM('Hamburg Knights'!R48:R52)","v":0},null,{"$f":"SUM('Hamburg Knights'!T48:T52)","v":1},{"$f":"SUM('Hamburg Knights'!U48:U52)","v":0},{"$f":"SUM('Hamburg Knights'!V48:V52)","v":0},null,{"$f":"IF(ISERROR(G71/D71),0,G71/D71)","v":0},{"$f":"IF(ISERROR((4*J71+3*I71+2*H71+G71-SUM(H71:J71))/D71),0,(4*J71+3*I71+2*H71+G71-SUM(H71:J71))/D71)","v":0},{"$f":"W71+X71","v":0},{"$f":"IF(ISERROR((G71+L71+M71)/(D71+L71+M71+Q71)),0,(G71+L71+M71)/(D71+L71+M71+Q71))","v":0},{"$f":"Z71+X71","v":0},null,{"$f":"IF(ISERROR((S71+T71)/(U71+S71+T71)),0,(S71+T71)/(U71+S71+T71))","v":1}]
[{"$f":"'Haar Disciples'!A73","v":515},{"$f":"IF('Haar Disciples'!B73=\"\",\"\",'Haar Disciples'!B73)","v":"Pozgaj"},{"$f":"SUM('Haar Disciples'!D73:D77)","v":1},{"$f":"SUM('Haar Disciples'!E73:E77)","v":1},{"$f":"SUM('Haar Disciples'!F73:F77)","v":0},{"$f":"SUM('Haar Disciples'!G73:G77)","v":0},{"$f":"SUM('Haar Disciples'!H73:H77)","v":0},{"$f":"SUM('Haar Disciples'!I73:I77)","v":0},{"$f":"SUM('Haar Disciples'!J73:J77)","v":0},{"$f":"SUM('Haar Disciples'!K73:K77)","v":0},{"$f":"SUM('Haar Disciples'!L73:L77)","v":0},{"$f":"SUM('Haar Disciples'!M73:M77)","v":0},{"$f":"SUM('Haar Disciples'!N73:N77)","v":0},{"$f":"SUM('Haar Disciples'!O73:O77)","v":0},{"$f":"SUM('Haar Disciples'!P73:P77)","v":0},{"$f":"SUM('Haar Disciples'!Q73:Q77)","v":0},{"$f":"SUM('Haar Disciples'!R73:R77)","v":0},null,{"$f":"SUM('Haar Disciples'!T73:T77)","v":1},{"$f":"SUM('Haar Disciples'!U73:U77)","v":4},{"$f":"SUM('Haar Disciples'!V73:V77)","v":0},null,{"$f":"IF(ISERROR(G72/D72),0,G72/D72)","v":0},{"$f":"IF(ISERROR((4*J72+3*I72+2*H72+G72-SUM(H72:J72))/D72),0,(4*J72+3*I72+2*H72+G72-SUM(H72:J72))/D72)","v":0},{"$f":"W72+X72","v":0},{"$f":"IF(ISERROR((G72+L72+M72)/(D72+L72+M72+Q72)),0,(G72+L72+M72)/(D72+L72+M72+Q72))","v":0},{"$f":"Z72+X72","v":0},null,{"$f":"IF(ISERROR((S72+T72)/(U72+S72+T72)),0,(S72+T72)/(U72+S72+T72))","v":1}]
[{"$f":"'Hamburg Knights'!A53","v":11},{"$f":"IF('Hamburg Knights'!B53=\"\",\"\",'Hamburg Knights'!B53)","v":"Flügge"},{"$f":"SUM('Hamburg Knights'!D53:D57)","v":1},{"$f":"SUM('Hamburg Knights'!E53:E57)","v":1},{"$f":"SUM('Hamburg Knights'!F53:F57)","v":0},{"$f":"SUM('Hamburg Knights'!G53:G57)","v":0},{"$f":"SUM('Hamburg Knights'!H53:H57)","v":0},{"$f":"SUM('Hamburg Knights'!I53:I57)","v":0},{"$f":"SUM('Hamburg Knights'!J53:J57)","v":0},{"$f":"SUM('Hamburg Knights'!K53:K57)","v":0},{"$f":"SUM('Hamburg Knights'!L53:L57)","v":1},{"$f":"SUM('Hamburg Knights'!M53:M57)","v":0},{"$f":"SUM('Hamburg Knights'!N53:N57)","v":0},{"$f":"SUM('Hamburg Knights'!O53:O57)","v":0},{"$f":"SUM('Hamburg Knights'!P53:P57)","v":0},{"$f":"SUM('Hamburg Knights'!Q53:Q57)","v":0},{"$f":"SUM('Hamburg Knights'!R53:R57)","v":0},null,{"$f":"SUM('Hamburg Knights'!T53:T57)","v":0},{"$f":"SUM('Hamburg Knights'!U53:U57)","v":2},{"$f":"SUM('Hamburg Knights'!V53:V57)","v":2},null,{"$f":"IF(ISERROR(G73/D73),0,G73/D73)","v":0},{"$f":"IF(ISERROR((4*J73+3*I73+2*H73+G73-SUM(H73:J73))/D73),0,(4*J73+3*I73+2*H73+G73-SUM(H73:J73))/D73)","v":0},{"$f":"W73+X73","v":0},{"$f":"IF(ISERROR((G73+L73+M73)/(D73+L73+M73+Q73)),0,(G73+L73+M73)/(D73+L73+M73+Q73))","v":0},{"$f":"Z73+X73","v":0},null,{"$f":"IF(ISERROR((S73+T73)/(U73+S73+T73)),0,(S73+T73)/(U73+S73+T73))","v":0.5}]
[{"$f":"'Hamburg Knights'!A18","v":4},{"$f":"IF('Hamburg Knights'!B18=\"\",\"\",'Hamburg Knights'!B18)","v":"Haase"},{"$f":"SUM('Hamburg Knights'!D18:D22)","v":1},{"$f":"SUM('Hamburg Knights'!E18:E22)","v":1},{"$f":"SUM('Hamburg Knights'!F18:F22)","v":0},{"$f":"SUM('Hamburg Knights'!G18:G22)","v":0},{"$f":"SUM('Hamburg Knights'!H18:H22)","v":0},{"$f":"SUM('Hamburg Knights'!I18:I22)","v":0},{"$f":"SUM('Hamburg Knights'!J18:J22)","v":0},{"$f":"SUM('Hamburg Knights'!K18:K22)","v":0},{"$f":"SUM('Hamburg Knights'!L18:L22)","v":1},{"$f":"SUM('Hamburg Knights'!M18:M22)","v":0},{"$f":"SUM('Hamburg Knights'!N18:N22)","v":0},{"$f":"SUM('Hamburg Knights'!O18:O22)","v":0},{"$f":"SUM('Hamburg Knights'!P18:P22)","v":0},{"$f":"SUM('Hamburg Knights'!Q18:Q22)","v":0},{"$f":"SUM('Hamburg Knights'!R18:R22)","v":0},null,{"$f":"SUM('Hamburg Knights'!T18:T22)","v":0},{"$f":"SUM('Hamburg Knights'!U18:U22)","v":0},{"$f":"SUM('Hamburg Knights'!V18:V22)","v":1},null,{"$f":"IF(ISERROR(G74/D74),0,G74/D74)","v":0},{"$f":"IF(ISERROR((4*J74+3*I74+2*H74+G74-SUM(H74:J74))/D74),0,(4*J74+3*I74+2*H74+G74-SUM(H74:J74))/D74)","v":0},{"$f":"W74+X74","v":0},{"$f":"IF(ISERROR((G74+L74+M74)/(D74+L74+M74+Q74)),0,(G74+L74+M74)/(D74+L74+M74+Q74))","v":0},{"$f":"Z74+X74","v":0},null,{"$f":"IF(ISERROR((S74+T74)/(U74+S74+T74)),0,(S74+T74)/(U74+S74+T74))","v":0}]
[{"$f":"'Hamburg Knights'!A43","v":9},{"$f":"IF('Hamburg Knights'!B43=\"\",\"\",'Hamburg Knights'!B43)","v":"Tikrani"},{"$f":"SUM('Hamburg Knights'!D43:D47)","v":1},{"$f":"SUM('Hamburg Knights'!E43:E47)","v":1},{"$f":"SUM('Hamburg Knights'!F43:F47)","v":0},{"$f":"SUM('Hamburg Knights'!G43:G47)","v":0},{"$f":"SUM('Hamburg Knights'!H43:H47)","v":0},{"$f":"SUM('Hamburg Knights'!I43:I47)","v":0},{"$f":"SUM('Hamburg Knights'!J43:J47)","v":0},{"$f":"SUM('Hamburg Knights'!K43:K47)","v":0},{"$f":"SUM('Hamburg Knights'!L43:L47)","v":1},{"$f":"SUM('Hamburg Knights'!M43:M47)","v":0},{"$f":"SUM('Hamburg Knights'!N43:N47)","v":0},{"$f":"SUM('Hamburg Knights'!O43:O47)","v":0},{"$f":"SUM('Hamburg Knights'!P43:P47)","v":0},{"$f":"SUM('Hamburg Knights'!Q43:Q47)","v":0},{"$f":"SUM('Hamburg Knights'!R43:R47)","v":0},null,{"$f":"SUM('Hamburg Knights'!T43:T47)","v":0},{"$f":"SUM('Hamburg Knights'!U43:U47)","v":0},{"$f":"SUM('Hamburg Knights'!V43:V47)","v":0},null,{"$f":"IF(ISERROR(G75/D75),0,G75/D75)","v":0},{"$f":"IF(ISERROR((4*J75+3*I75+2*H75+G75-SUM(H75:J75))/D75),0,(4*J75+3*I75+2*H75+G75-SUM(H75:J75))/D75)","v":0},{"$f":"W75+X75","v":0},{"$f":"IF(ISERROR((G75+L75+M75)/(D75+L75+M75+Q75)),0,(G75+L75+M75)/(D75+L75+M75+Q75))","v":0},{"$f":"Z75+X75","v":0},null,{"$f":"IF(ISERROR((S75+T75)/(U75+S75+T75)),0,(S75+T75)/(U75+S75+T75))","v":0}]
[{"$f":"'Freising Grizzlies'!A13","v":34},{"$f":"IF('Freising Grizzlies'!B13=\"\",\"\",'Freising Grizzlies'!B13)","v":"Mann"},{"$f":"SUM('Freising Grizzlies'!D13:D17)","v":1},{"$f":"SUM('Freising Grizzlies'!E13:E17)","v":1},{"$f":"SUM('Freising Grizzlies'!F13:F17)","v":0},{"$f":"SUM('Freising Grizzlies'!G13:G17)","v":1},{"$f":"SUM('Freising Grizzlies'!H13:H17)","v":0},{"$f":"SUM('Freising Grizzlies'!I13:I17)","v":0},{"$f":"SUM('Freising Grizzlies'!J13:J17)","v":0},{"$f":"SUM('Freising Grizzlies'!K13:K17)","v":0},{"$f":"SUM('Freising Grizzlies'!L13:L17)","v":0},{"$f":"SUM('Freising Grizzlies'!M13:M17)","v":0},{"$f":"SUM('Freising Grizzlies'!N13:N17)","v":0},{"$f":"SUM('Freising Grizzlies'!O13:O17)","v":0},{"$f":"SUM('Freising Grizzlies'!P13:P17)","v":0},{"$f":"SUM('Freising Grizzlies'!Q13:Q17)","v":0},{"$f":"SUM('Freising Grizzlies'!R13:R17)","v":0},null,{"$f":"SUM('Freising Grizzlies'!T13:T17)","v":0},{"$f":"SUM('Freising Grizzlies'!U13:U17)","v":0},{"$f":"SUM('Freising Grizzlies'!V13:V17)","v":0},null,{"$f":"IF(ISERROR(G76/D76),0,G76/D76)","v":0},{"$f":"IF(ISERROR((4*J76+3*I76+2*H76+G76-SUM(H76:J76))/D76),0,(4*J76+3*I76+2*H76+G76-SUM(H76:J76))/D76)","v":0},{"$f":"W76+X76","v":0},{"$f":"IF(ISERROR((G76+L76+M76)/(D76+L76+M76+Q76)),0,(G76+L76+M76)/(D76+L76+M76+Q76))","v":0},{"$f":"Z76+X76","v":0},null,{"$f":"IF(ISERROR((S76+T76)/(U76+S76+T76)),0,(S76+T76)/(U76+S76+T76))","v":0}]
[{"$f":"'Haar Disciples'!A78","v":516},{"$f":"IF('Haar Disciples'!B78=\"\",\"\",'Haar Disciples'!B78)","v":"Kuprian"},{"$f":"SUM('Haar Disciples'!D78:D82)","v":1},{"$f":"SUM('Haar Disciples'!E78:E82)","v":1},{"$f":"SUM('Haar Disciples'!F78:F82)","v":0},{"$f":"SUM('Haar Disciples'!G78:G82)","v":0},{"$f":"SUM('Haar Disciples'!H78:H82)","v":0},{"$f":"SUM('Haar Disciples'!I78:I82)","v":0},{"$f":"SUM('Haar Disciples'!J78:J82)","v":0},{"$f":"SUM('Haar Disciples'!K78:K82)","v":0},{"$f":"SUM('Haar Disciples'!L78:L82)","v":1},{"$f":"SUM('Haar Disciples'!M78:M82)","v":0},{"$f":"SUM('Haar Disciples'!N78:N82)","v":0},{"$f":"SUM('Haar Disciples'!O78:O82)","v":0},{"$f":"SUM('Haar Disciples'!P78:P82)","v":0},{"$f":"SUM('Haar Disciples'!Q78:Q82)","v":0},{"$f":"SUM('Haar Disciples'!R78:R82)","v":0},null,{"$f":"SUM('Haar Disciples'!T78:T82)","v":0},{"$f":"SUM('Haar Disciples'!U78:U82)","v":0},{"$f":"SUM('Haar Disciples'!V78:V82)","v":0},null,{"$f":"IF(ISERROR(G77/D77),0,G77/D77)","v":0},{"$f":"IF(ISERROR((4*J77+3*I77+2*H77+G77-SUM(H77:J77))/D77),0,(4*J77+3*I77+2*H77+G77-SUM(H77:J77))/D77)","v":0},{"$f":"W77+X77","v":0},{"$f":"IF(ISERROR((G77+L77+M77)/(D77+L77+M77+Q77)),0,(G77+L77+M77)/(D77+L77+M77+Q77))","v":0},{"$f":"Z77+X77","v":0},null,{"$f":"IF(ISERROR((S77+T77)/(U77+S77+T77)),0,(S77+T77)/(U77+S77+T77))","v":0}]
[{"$f":"'Wesseling Vermins'!A58","v":0},{"$f":"IF('Wesseling Vermins'!B58=\"\",\"\",'Wesseling Vermins'!B58)","v":""},{"$f":"SUM('Wesseling Vermins'!D58:D62)","v":0},{"$f":"SUM('Wesseling Vermins'!E58:E62)","v":0},{"$f":"SUM('Wesseling Vermins'!F58:F62)","v":0},{"$f":"SUM('Wesseling Vermins'!G58:G62)","v":0},{"$f":"SUM('Wesseling Vermins'!H58:H62)","v":0},{"$f":"SUM('Wesseling Vermins'!I58:I62)","v":0},{"$f":"SUM('Wesseling Vermins'!J58:J62)","v":0},{"$f":"SUM('Wesseling Vermins'!K58:K62)","v":0},{"$f":"SUM('Wesseling Vermins'!L58:L62)","v":0},{"$f":"SUM('Wesseling Vermins'!M58:M62)","v":0},{"$f":"SUM('Wesseling Vermins'!N58:N62)","v":0},{"$f":"SUM('Wesseling Vermins'!O58:O62)","v":0},{"$f":"SUM('Wesseling Vermins'!P58:P62)","v":0},{"$f":"SUM('Wesseling Vermins'!Q58:Q62)","v":0},{"$f":"SUM('Wesseling Vermins'!R58:R62)","v":0},null,{"$f":"SUM('Wesseling Vermins'!T58:T62)","v":0},{"$f":"SUM('Wesseling Vermins'!U58:U62)","v":0},{"$f":"SUM('Wesseling Vermins'!V58:V62)","v":0},null,{"$f":"IF(ISERROR(G78/D78),0,G78/D78)","v":0},{"$f":"IF(ISERROR((4*J78+3*I78+2*H78+G78-SUM(H78:J78))/D78),0,(4*J78+3*I78+2*H78+G78-SUM(H78:J78))/D78)","v":0},{"$f":"W78+X78","v":0},{"$f":"IF(ISERROR((G78+L78+M78)/(D78+L78+M78+Q78)),0,(G78+L78+M78)/(D78+L78+M78+Q78))","v":0},{"$f":"Z78+X78","v":0},null,{"$f":"IF(ISERROR((S78+T78)/(U78+S78+T78)),0,(S78+T78)/(U78+S78+T78))","v":0}]
[{"$f":"'Hamburg Knights'!A83","v":17},{"$f":"IF('Hamburg Knights'!B83=\"\",\"\",'Hamburg Knights'!B83)","v":"Flohr"},{"$f":"SUM('Hamburg Knights'!D83:D87)","v":0},{"$f":"SUM('Hamburg Knights'!E83:E87)","v":0},{"$f":"SUM('Hamburg Knights'!F83:F87)","v":0},{"$f":"SUM('Hamburg Knights'!G83:G87)","v":0},{"$f":"SUM('Hamburg Knights'!H83:H87)","v":0},{"$f":"SUM('Hamburg Knights'!I83:I87)","v":0},{"$f":"SUM('Hamburg Knights'!J83:J87)","v":0},{"$f":"SUM('Hamburg Knights'!K83:K87)","v":0},{"$f":"SUM('Hamburg Knights'!L83:L87)","v":0},{"$f":"SUM('Hamburg Knights'!M83:M87)","v":0},{"$f":"SUM('Hamburg Knights'!N83:N87)","v":0},{"$f":"SUM('Hamburg Knights'!O83:O87)","v":0},{"$f":"SUM('Hamburg Knights'!P83:P87)","v":0},{"$f":"SUM('Hamburg Knights'!Q83:Q87)","v":0},{"$f":"SUM('Hamburg Knights'!R83:R87)","v":0},null,{"$f":"SUM('Hamburg Knights'!T83:T87)","v":0},{"$f":"SUM('Hamburg Knights'!U83:U87)","v":0},{"$f":"SUM('Hamburg Knights'!V83:V87)","v":0},null,{"$f":"IF(ISERROR(G79/D79),0,G79/D79)","v":0},{"$f":"IF(ISERROR((4*J79+3*I79+2*H79+G79-SUM(H79:J79))/D79),0,(4*J79+3*I79+2*H79+G79-SUM(H79:J79))/D79)","v":0},{"$f":"W79+X79","v":0},{"$f":"IF(ISERROR((G79+L79+M79)/(D79+L79+M79+Q79)),0,(G79+L79+M79)/(D79+L79+M79+Q79))","v":0},{"$f":"Z79+X79","v":0},null,{"$f":"IF(ISERROR((S79+T79)/(U79+S79+T79)),0,(S79+T79)/(U79+S79+T79))","v":0}]
[{"$f":"'Karlsruhe Cougars'!A48","v":66},{"$f":"IF('Karlsruhe Cougars'!B48=\"\",\"\",'Karlsruhe Cougars'!B48)","v":""},{"$f":"SUM('Karlsruhe Cougars'!D48:D52)","v":0},{"$f":"SUM('Karlsruhe Cougars'!E48:E52)","v":0},{"$f":"SUM('Karlsruhe Cougars'!F48:F52)","v":0},{"$f":"SUM('Karlsruhe Cougars'!G48:G52)","v":0},{"$f":"SUM('Karlsruhe Cougars'!H48:H52)","v":0},{"$f":"SUM('Karlsruhe Cougars'!I48:I52)","v":0},{"$f":"SUM('Karlsruhe Cougars'!J48:J52)","v":0},{"$f":"SUM('Karlsruhe Cougars'!K48:K52)","v":0},{"$f":"SUM('Karlsruhe Cougars'!L48:L52)","v":0},{"$f":"SUM('Karlsruhe Cougars'!M48:M52)","v":0},{"$f":"SUM('Karlsruhe Cougars'!N48:N52)","v":0},{"$f":"SUM('Karlsruhe Cougars'!O48:O52)","v":0},{"$f":"SUM('Karlsruhe Cougars'!P48:P52)","v":0},{"$f":"SUM('Karlsruhe Cougars'!Q48:Q52)","v":0},{"$f":"SUM('Karlsruhe Cougars'!R48:R52)","v":0},null,{"$f":"SUM('Karlsruhe Cougars'!T48:T52)","v":0},{"$f":"SUM('Karlsruhe Cougars'!U48:U52)","v":0},{"$f":"SUM('Karlsruhe Cougars'!V48:V52)","v":0},null,{"$f":"IF(ISERROR(G80/D80),0,G80/D80)","v":0},{"$f":"IF(ISERROR((4*J80+3*I80+2*H80+G80-SUM(H80:J80))/D80),0,(4*J80+3*I80+2*H80+G80-SUM(H80:J80))/D80)","v":0},{"$f":"W80+X80","v":0},{"$f":"IF(ISERROR((G80+L80+M80)/(D80+L80+M80+Q80)),0,(G80+L80+M80)/(D80+L80+M80+Q80))","v":0},{"$f":"Z80+X80","v":0},null,{"$f":"IF(ISERROR((S80+T80)/(U80+S80+T80)),0,(S80+T80)/(U80+S80+T80))","v":0}]
[{"$f":"'Knights 2'!A23","v":205},{"$f":"IF('Knights 2'!B23=\"\",\"\",'Knights 2'!B23)","v":""},{"$f":"SUM('Knights 2'!D23:D27)","v":0},{"$f":"SUM('Knights 2'!E23:E27)","v":0},{"$f":"SUM('Knights 2'!F23:F27)","v":0},{"$f":"SUM('Knights 2'!G23:G27)","v":0},{"$f":"SUM('Knights 2'!H23:H27)","v":0},{"$f":"SUM('Knights 2'!I23:I27)","v":0},{"$f":"SUM('Knights 2'!J23:J27)","v":0},{"$f":"SUM('Knights 2'!K23:K27)","v":0},{"$f":"SUM('Knights 2'!L23:L27)","v":0},{"$f":"SUM('Knights 2'!M23:M27)","v":0},{"$f":"SUM('Knights 2'!N23:N27)","v":0},{"$f":"SUM('Knights 2'!O23:O27)","v":0},{"$f":"SUM('Knights 2'!P23:P27)","v":0},{"$f":"SUM('Knights 2'!Q23:Q27)","v":0},{"$f":"SUM('Knights 2'!R23:R27)","v":0},null,{"$f":"SUM('Knights 2'!T23:T27)","v":0},{"$f":"SUM('Knights 2'!U23:U27)","v":0},{"$f":"SUM('Knights 2'!V23:V27)","v":0},null,{"$f":"IF(ISERROR(G81/D81),0,G81/D81)","v":0},{"$f":"IF(ISERROR((4*J81+3*I81+2*H81+G81-SUM(H81:J81))/D81),0,(4*J81+3*I81+2*H81+G81-SUM(H81:J81))/D81)","v":0},{"$f":"W81+X81","v":0},{"$f":"IF(ISERROR((G81+L81+M81)/(D81+L81+M81+Q81)),0,(G81+L81+M81)/(D81+L81+M81+Q81))","v":0},{"$f":"Z81+X81","v":0},null,{"$f":"IF(ISERROR((S81+T81)/(U81+S81+T81)),0,(S81+T81)/(U81+S81+T81))","v":0}]
[{"$f":"'Knights 2'!A28","v":206},{"$f":"IF('Knights 2'!B28=\"\",\"\",'Knights 2'!B28)","v":""},{"$f":"SUM('Knights 2'!D28:D32)","v":0},{"$f":"SUM('Knights 2'!E28:E32)","v":0},{"$f":"SUM('Knights 2'!F28:F32)","v":0},{"$f":"SUM('Knights 2'!G28:G32)","v":0},{"$f":"SUM('Knights 2'!H28:H32)","v":0},{"$f":"SUM('Knights 2'!I28:I32)","v":0},{"$f":"SUM('Knights 2'!J28:J32)","v":0},{"$f":"SUM('Knights 2'!K28:K32)","v":0},{"$f":"SUM('Knights 2'!L28:L32)","v":0},{"$f":"SUM('Knights 2'!M28:M32)","v":0},{"$f":"SUM('Knights 2'!N28:N32)","v":0},{"$f":"SUM('Knights 2'!O28:O32)","v":0},{"$f":"SUM('Knights 2'!P28:P32)","v":0},{"$f":"SUM('Knights 2'!Q28:Q32)","v":0},{"$f":"SUM('Knights 2'!R28:R32)","v":0},null,{"$f":"SUM('Knights 2'!T28:T32)","v":0},{"$f":"SUM('Knights 2'!U28:U32)","v":0},{"$f":"SUM('Knights 2'!V28:V32)","v":0},null,{"$f":"IF(ISERROR(G82/D82),0,G82/D82)","v":0},{"$f":"IF(ISERROR((4*J82+3*I82+2*H82+G82-SUM(H82:J82))/D82),0,(4*J82+3*I82+2*H82+G82-SUM(H82:J82))/D82)","v":0},{"$f":"W82+X82","v":0},{"$f":"IF(ISERROR((G82+L82+M82)/(D82+L82+M82+Q82)),0,(G82+L82+M82)/(D82+L82+M82+Q82))","v":0},{"$f":"Z82+X82","v":0},null,{"$f":"IF(ISERROR((S82+T82)/(U82+S82+T82)),0,(S82+T82)/(U82+S82+T82))","v":0}]
[{"$f":"'Knights 2'!A33","v":207},{"$f":"IF('Knights 2'!B33=\"\",\"\",'Knights 2'!B33)","v":""},{"$f":"SUM('Knights 2'!D33:D37)","v":0},{"$f":"SUM('Knights 2'!E33:E37)","v":0},{"$f":"SUM('Knights 2'!F33:F37)","v":0},{"$f":"SUM('Knights 2'!G33:G37)","v":0},{"$f":"SUM('Knights 2'!H33:H37)","v":0},{"$f":"SUM('Knights 2'!I33:I37)","v":0},{"$f":"SUM('Knights 2'!J33:J37)","v":0},{"$f":"SUM('Knights 2'!K33:K37)","v":0},{"$f":"SUM('Knights 2'!L33:L37)","v":0},{"$f":"SUM('Knights 2'!M33:M37)","v":0},{"$f":"SUM('Knights 2'!N33:N37)","v":0},{"$f":"SUM('Knights 2'!O33:O37)","v":0},{"$f":"SUM('Knights 2'!P33:P37)","v":0},{"$f":"SUM('Knights 2'!Q33:Q37)","v":0},{"$f":"SUM('Knights 2'!R33:R37)","v":0},null,{"$f":"SUM('Knights 2'!T33:T37)","v":0},{"$f":"SUM('Knights 2'!U33:U37)","v":0},{"$f":"SUM('Knights 2'!V33:V37)","v":0},null,{"$f":"IF(ISERROR(G83/D83),0,G83/D83)","v":0},{"$f":"IF(ISERROR((4*J83+3*I83+2*H83+G83-SUM(H83:J83))/D83),0,(4*J83+3*I83+2*H83+G83-SUM(H83:J83))/D83)","v":0},{"$f":"W83+X83","v":0},{"$f":"IF(ISERROR((G83+L83+M83)/(D83+L83+M83+Q83)),0,(G83+L83+M83)/(D83+L83+M83+Q83))","v":0},{"$f":"Z83+X83","v":0},null,{"$f":"IF(ISERROR((S83+T83)/(U83+S83+T83)),0,(S83+T83)/(U83+S83+T83))","v":0}]
[{"$f":"'Knights 2'!A38","v":208},{"$f":"IF('Knights 2'!B38=\"\",\"\",'Knights 2'!B38)","v":""},{"$f":"SUM('Knights 2'!D38:D42)","v":0},{"$f":"SUM('Knights 2'!E38:E42)","v":0},{"$f":"SUM('Knights 2'!F38:F42)","v":0},{"$f":"SUM('Knights 2'!G38:G42)","v":0},{"$f":"SUM('Knights 2'!H38:H42)","v":0},{"$f":"SUM('Knights 2'!I38:I42)","v":0},{"$f":"SUM('Knights 2'!J38:J42)","v":0},{"$f":"SUM('Knights 2'!K38:K42)","v":0},{"$f":"SUM('Knights 2'!L38:L42)","v":0},{"$f":"SUM('Knights 2'!M38:M42)","v":0},{"$f":"SUM('Knights 2'!N38:N42)","v":0},{"$f":"SUM('Knights 2'!O38:O42)","v":0},{"$f":"SUM('Knights 2'!P38:P42)","v":0},{"$f":"SUM('Knights 2'!Q38:Q42)","v":0},{"$f":"SUM('Knights 2'!R38:R42)","v":0},null,{"$f":"SUM('Knights 2'!T38:T42)","v":0},{"$f":"SUM('Knights 2'!U38:U42)","v":0},{"$f":"SUM('Knights 2'!V38:V42)","v":0},null,{"$f":"IF(ISERROR(G84/D84),0,G84/D84)","v":0},{"$f":"IF(ISERROR((4*J84+3*I84+2*H84+G84-SUM(H84:J84))/D84),0,(4*J84+3*I84+2*H84+G84-SUM(H84:J84))/D84)","v":0},{"$f":"W84+X84","v":0},{"$f":"IF(ISERROR((G84+L84+M84)/(D84+L84+M84+Q84)),0,(G84+L84+M84)/(D84+L84+M84+Q84))","v":0},{"$f":"Z84+X84","v":0},null,{"$f":"IF(ISERROR((S84+T84)/(U84+S84+T84)),0,(S84+T84)/(U84+S84+T84))","v":0}]
[{"$f":"'Knights 2'!A43","v":209},{"$f":"IF('Knights 2'!B43=\"\",\"\",'Knights 2'!B43)","v":""},{"$f":"SUM('Knights 2'!D43:D47)","v":0},{"$f":"SUM('Knights 2'!E43:E47)","v":0},{"$f":"SUM('Knights 2'!F43:F47)","v":0},{"$f":"SUM('Knights 2'!G43:G47)","v":0},{"$f":"SUM('Knights 2'!H43:H47)","v":0},{"$f":"SUM('Knights 2'!I43:I47)","v":0},{"$f":"SUM('Knights 2'!J43:J47)","v":0},{"$f":"SUM('Knights 2'!K43:K47)","v":0},{"$f":"SUM('Knights 2'!L43:L47)","v":0},{"$f":"SUM('Knights 2'!M43:M47)","v":0},{"$f":"SUM('Knights 2'!N43:N47)","v":0},{"$f":"SUM('Knights 2'!O43:O47)","v":0},{"$f":"SUM('Knights 2'!P43:P47)","v":0},{"$f":"SUM('Knights 2'!Q43:Q47)","v":0},{"$f":"SUM('Knights 2'!R43:R47)","v":0},null,{"$f":"SUM('Knights 2'!T43:T47)","v":0},{"$f":"SUM('Knights 2'!U43:U47)","v":0},{"$f":"SUM('Knights 2'!V43:V47)","v":0},null,{"$f":"IF(ISERROR(G85/D85),0,G85/D85)","v":0},{"$f":"IF(ISERROR((4*J85+3*I85+2*H85+G85-SUM(H85:J85))/D85),0,(4*J85+3*I85+2*H85+G85-SUM(H85:J85))/D85)","v":0},{"$f":"W85+X85","v":0},{"$f":"IF(ISERROR((G85+L85+M85)/(D85+L85+M85+Q85)),0,(G85+L85+M85)/(D85+L85+M85+Q85))","v":0},{"$f":"Z85+X85","v":0},null,{"$f":"IF(ISERROR((S85+T85)/(U85+S85+T85)),0,(S85+T85)/(U85+S85+T85))","v":0}]
[{"$f":"'Knights 2'!A48","v":210},{"$f":"IF('Knights 2'!B48=\"\",\"\",'Knights 2'!B48)","v":""},{"$f":"SUM('Knights 2'!D48:D52)","v":0},{"$f":"SUM('Knights 2'!E48:E52)","v":0},{"$f":"SUM('Knights 2'!F48:F52)","v":0},{"$f":"SUM('Knights 2'!G48:G52)","v":0},{"$f":"SUM('Knights 2'!H48:H52)","v":0},{"$f":"SUM('Knights 2'!I48:I52)","v":0},{"$f":"SUM('Knights 2'!J48:J52)","v":0},{"$f":"SUM('Knights 2'!K48:K52)","v":0},{"$f":"SUM('Knights 2'!L48:L52)","v":0},{"$f":"SUM('Knights 2'!M48:M52)","v":0},{"$f":"SUM('Knights 2'!N48:N52)","v":0},{"$f":"SUM('Knights 2'!O48:O52)","v":0},{"$f":"SUM('Knights 2'!P48:P52)","v":0},{"$f":"SUM('Knights 2'!Q48:Q52)","v":0},{"$f":"SUM('Knights 2'!R48:R52)","v":0},null,{"$f":"SUM('Knights 2'!T48:T52)","v":0},{"$f":"SUM('Knights 2'!U48:U52)","v":0},{"$f":"SUM('Knights 2'!V48:V52)","v":0},null,{"$f":"IF(ISERROR(G86/D86),0,G86/D86)","v":0},{"$f":"IF(ISERROR((4*J86+3*I86+2*H86+G86-SUM(H86:J86))/D86),0,(4*J86+3*I86+2*H86+G86-SUM(H86:J86))/D86)","v":0},{"$f":"W86+X86","v":0},{"$f":"IF(ISERROR((G86+L86+M86)/(D86+L86+M86+Q86)),0,(G86+L86+M86)/(D86+L86+M86+Q86))","v":0},{"$f":"Z86+X86","v":0},null,{"$f":"IF(ISERROR((S86+T86)/(U86+S86+T86)),0,(S86+T86)/(U86+S86+T86))","v":0}]
[{"$f":"'Knights 2'!A53","v":211},{"$f":"IF('Knights 2'!B53=\"\",\"\",'Knights 2'!B53)","v":""},{"$f":"SUM('Knights 2'!D53:D57)","v":0},{"$f":"SUM('Knights 2'!E53:E57)","v":0},{"$f":"SUM('Knights 2'!F53:F57)","v":0},{"$f":"SUM('Knights 2'!G53:G57)","v":0},{"$f":"SUM('Knights 2'!H53:H57)","v":0},{"$f":"SUM('Knights 2'!I53:I57)","v":0},{"$f":"SUM('Knights 2'!J53:J57)","v":0},{"$f":"SUM('Knights 2'!K53:K57)","v":0},{"$f":"SUM('Knights 2'!L53:L57)","v":0},{"$f":"SUM('Knights 2'!M53:M57)","v":0},{"$f":"SUM('Knights 2'!N53:N57)","v":0},{"$f":"SUM('Knights 2'!O53:O57)","v":0},{"$f":"SUM('Knights 2'!P53:P57)","v":0},{"$f":"SUM('Knights 2'!Q53:Q57)","v":0},{"$f":"SUM('Knights 2'!R53:R57)","v":0},null,{"$f":"SUM('Knights 2'!T53:T57)","v":0},{"$f":"SUM('Knights 2'!U53:U57)","v":0},{"$f":"SUM('Knights 2'!V53:V57)","v":0},null,{"$f":"IF(ISERROR(G87/D87),0,G87/D87)","v":0},{"$f":"IF(ISERROR((4*J87+3*I87+2*H87+G87-SUM(H87:J87))/D87),0,(4*J87+3*I87+2*H87+G87-SUM(H87:J87))/D87)","v":0},{"$f":"W87+X87","v":0},{"$f":"IF(ISERROR((G87+L87+M87)/(D87+L87+M87+Q87)),0,(G87+L87+M87)/(D87+L87+M87+Q87))","v":0},{"$f":"Z87+X87","v":0},null,{"$f":"IF(ISERROR((S87+T87)/(U87+S87+T87)),0,(S87+T87)/(U87+S87+T87))","v":0}]
[{"$f":"'Knights 2'!A58","v":212},{"$f":"IF('Knights 2'!B58=\"\",\"\",'Knights 2'!B58)","v":""},{"$f":"SUM('Knights 2'!D58:D62)","v":0},{"$f":"SUM('Knights 2'!E58:E62)","v":0},{"$f":"SUM('Knights 2'!F58:F62)","v":0},{"$f":"SUM('Knights 2'!G58:G62)","v":0},{"$f":"SUM('Knights 2'!H58:H62)","v":0},{"$f":"SUM('Knights 2'!I58:I62)","v":0},{"$f":"SUM('Knights 2'!J58:J62)","v":0},{"$f":"SUM('Knights 2'!K58:K62)","v":0},{"$f":"SUM('Knights 2'!L58:L62)","v":0},{"$f":"SUM('Knights 2'!M58:M62)","v":0},{"$f":"SUM('Knights 2'!N58:N62)","v":0},{"$f":"SUM('Knights 2'!O58:O62)","v":0},{"$f":"SUM('Knights 2'!P58:P62)","v":0},{"$f":"SUM('Knights 2'!Q58:Q62)","v":0},{"$f":"SUM('Knights 2'!R58:R62)","v":0},null,{"$f":"SUM('Knights 2'!T58:T62)","v":0},{"$f":"SUM('Knights 2'!U58:U62)","v":0},{"$f":"SUM('Knights 2'!V58:V62)","v":0},null,{"$f":"IF(ISERROR(G88/D88),0,G88/D88)","v":0},{"$f":"IF(ISERROR((4*J88+3*I88+2*H88+G88-SUM(H88:J88))/D88),0,(4*J88+3*I88+2*H88+G88-SUM(H88:J88))/D88)","v":0},{"$f":"W88+X88","v":0},{"$f":"IF(ISERROR((G88+L88+M88)/(D88+L88+M88+Q88)),0,(G88+L88+M88)/(D88+L88+M88+Q88))","v":0},{"$f":"Z88+X88","v":0},null,{"$f":"IF(ISERROR((S88+T88)/(U88+S88+T88)),0,(S88+T88)/(U88+S88+T88))","v":0}]
[{"$f":"'Knights 2'!A63","v":213},{"$f":"IF('Knights 2'!B63=\"\",\"\",'Knights 2'!B63)","v":""},{"$f":"SUM('Knights 2'!D63:D67)","v":0},{"$f":"SUM('Knights 2'!E63:E67)","v":0},{"$f":"SUM('Knights 2'!F63:F67)","v":0},{"$f":"SUM('Knights 2'!G63:G67)","v":0},{"$f":"SUM('Knights 2'!H63:H67)","v":0},{"$f":"SUM('Knights 2'!I63:I67)","v":0},{"$f":"SUM('Knights 2'!J63:J67)","v":0},{"$f":"SUM('Knights 2'!K63:K67)","v":0},{"$f":"SUM('Knights 2'!L63:L67)","v":0},{"$f":"SUM('Knights 2'!M63:M67)","v":0},{"$f":"SUM('Knights 2'!N63:N67)","v":0},{"$f":"SUM('Knights 2'!O63:O67)","v":0},{"$f":"SUM('Knights 2'!P63:P67)","v":0},{"$f":"SUM('Knights 2'!Q63:Q67)","v":0},{"$f":"SUM('Knights 2'!R63:R67)","v":0},null,{"$f":"SUM('Knights 2'!T63:T67)","v":0},{"$f":"SUM('Knights 2'!U63:U67)","v":0},{"$f":"SUM('Knights 2'!V63:V67)","v":0},null,{"$f":"IF(ISERROR(G89/D89),0,G89/D89)","v":0},{"$f":"IF(ISERROR((4*J89+3*I89+2*H89+G89-SUM(H89:J89))/D89),0,(4*J89+3*I89+2*H89+G89-SUM(H89:J89))/D89)","v":0},{"$f":"W89+X89","v":0},{"$f":"IF(ISERROR((G89+L89+M89)/(D89+L89+M89+Q89)),0,(G89+L89+M89)/(D89+L89+M89+Q89))","v":0},{"$f":"Z89+X89","v":0},null,{"$f":"IF(ISERROR((S89+T89)/(U89+S89+T89)),0,(S89+T89)/(U89+S89+T89))","v":0}]
[{"$f":"'Knights 2'!A68","v":214},{"$f":"IF('Knights 2'!B68=\"\",\"\",'Knights 2'!B68)","v":""},{"$f":"SUM('Knights 2'!D68:D72)","v":0},{"$f":"SUM('Knights 2'!E68:E72)","v":0},{"$f":"SUM('Knights 2'!F68:F72)","v":0},{"$f":"SUM('Knights 2'!G68:G72)","v":0},{"$f":"SUM('Knights 2'!H68:H72)","v":0},{"$f":"SUM('Knights 2'!I68:I72)","v":0},{"$f":"SUM('Knights 2'!J68:J72)","v":0},{"$f":"SUM('Knights 2'!K68:K72)","v":0},{"$f":"SUM('Knights 2'!L68:L72)","v":0},{"$f":"SUM('Knights 2'!M68:M72)","v":0},{"$f":"SUM('Knights 2'!N68:N72)","v":0},{"$f":"SUM('Knights 2'!O68:O72)","v":0},{"$f":"SUM('Knights 2'!P68:P72)","v":0},{"$f":"SUM('Knights 2'!Q68:Q72)","v":0},{"$f":"SUM('Knights 2'!R68:R72)","v":0},null,{"$f":"SUM('Knights 2'!T68:T72)","v":0},{"$f":"SUM('Knights 2'!U68:U72)","v":0},{"$f":"SUM('Knights 2'!V68:V72)","v":0},null,{"$f":"IF(ISERROR(G90/D90),0,G90/D90)","v":0},{"$f":"IF(ISERROR((4*J90+3*I90+2*H90+G90-SUM(H90:J90))/D90),0,(4*J90+3*I90+2*H90+G90-SUM(H90:J90))/D90)","v":0},{"$f":"W90+X90","v":0},{"$f":"IF(ISERROR((G90+L90+M90)/(D90+L90+M90+Q90)),0,(G90+L90+M90)/(D90+L90+M90+Q90))","v":0},{"$f":"Z90+X90","v":0},null,{"$f":"IF(ISERROR((S90+T90)/(U90+S90+T90)),0,(S90+T90)/(U90+S90+T90))","v":0}]
[{"$f":"'Knights 2'!A73","v":215},{"$f":"IF('Knights 2'!B73=\"\",\"\",'Knights 2'!B73)","v":""},{"$f":"SUM('Knights 2'!D73:D77)","v":0},{"$f":"SUM('Knights 2'!E73:E77)","v":0},{"$f":"SUM('Knights 2'!F73:F77)","v":0},{"$f":"SUM('Knights 2'!G73:G77)","v":0},{"$f":"SUM('Knights 2'!H73:H77)","v":0},{"$f":"SUM('Knights 2'!I73:I77)","v":0},{"$f":"SUM('Knights 2'!J73:J77)","v":0},{"$f":"SUM('Knights 2'!K73:K77)","v":0},{"$f":"SUM('Knights 2'!L73:L77)","v":0},{"$f":"SUM('Knights 2'!M73:M77)","v":0},{"$f":"SUM('Knights 2'!N73:N77)","v":0},{"$f":"SUM('Knights 2'!O73:O77)","v":0},{"$f":"SUM('Knights 2'!P73:P77)","v":0},{"$f":"SUM('Knights 2'!Q73:Q77)","v":0},{"$f":"SUM('Knights 2'!R73:R77)","v":0},null,{"$f":"SUM('Knights 2'!T73:T77)","v":0},{"$f":"SUM('Knights 2'!U73:U77)","v":0},{"$f":"SUM('Knights 2'!V73:V77)","v":0},null,{"$f":"IF(ISERROR(G91/D91),0,G91/D91)","v":0},{"$f":"IF(ISERROR((4*J91+3*I91+2*H91+G91-SUM(H91:J91))/D91),0,(4*J91+3*I91+2*H91+G91-SUM(H91:J91))/D91)","v":0},{"$f":"W91+X91","v":0},{"$f":"IF(ISERROR((G91+L91+M91)/(D91+L91+M91+Q91)),0,(G91+L91+M91)/(D91+L91+M91+Q91))","v":0},{"$f":"Z91+X91","v":0},null,{"$f":"IF(ISERROR((S91+T91)/(U91+S91+T91)),0,(S91+T91)/(U91+S91+T91))","v":0}]
[{"$f":"'Knights 2'!A78","v":216},{"$f":"IF('Knights 2'!B78=\"\",\"\",'Knights 2'!B78)","v":""},{"$f":"SUM('Knights 2'!D78:D82)","v":0},{"$f":"SUM('Knights 2'!E78:E82)","v":0},{"$f":"SUM('Knights 2'!F78:F82)","v":0},{"$f":"SUM('Knights 2'!G78:G82)","v":0},{"$f":"SUM('Knights 2'!H78:H82)","v":0},{"$f":"SUM('Knights 2'!I78:I82)","v":0},{"$f":"SUM('Knights 2'!J78:J82)","v":0},{"$f":"SUM('Knights 2'!K78:K82)","v":0},{"$f":"SUM('Knights 2'!L78:L82)","v":0},{"$f":"SUM('Knights 2'!M78:M82)","v":0},{"$f":"SUM('Knights 2'!N78:N82)","v":0},{"$f":"SUM('Knights 2'!O78:O82)","v":0},{"$f":"SUM('Knights 2'!P78:P82)","v":0},{"$f":"SUM('Knights 2'!Q78:Q82)","v":0},{"$f":"SUM('Knights 2'!R78:R82)","v":0},null,{"$f":"SUM('Knights 2'!T78:T82)","v":0},{"$f":"SUM('Knights 2'!U78:U82)","v":0},{"$f":"SUM('Knights 2'!V78:V82)","v":0},null,{"$f":"IF(ISERROR(G92/D92),0,G92/D92)","v":0},{"$f":"IF(ISERROR((4*J92+3*I92+2*H92+G92-SUM(H92:J92))/D92),0,(4*J92+3*I92+2*H92+G92-SUM(H92:J92))/D92)","v":0},{"$f":"W92+X92","v":0},{"$f":"IF(ISERROR((G92+L92+M92)/(D92+L92+M92+Q92)),0,(G92+L92+M92)/(D92+L92+M92+Q92))","v":0},{"$f":"Z92+X92","v":0},null,{"$f":"IF(ISERROR((S92+T92)/(U92+S92+T92)),0,(S92+T92)/(U92+S92+T92))","v":0}]
[{"$f":"'Knights 2'!A83","v":217},{"$f":"IF('Knights 2'!B83=\"\",\"\",'Knights 2'!B83)","v":""},{"$f":"SUM('Knights 2'!D83:D87)","v":0},{"$f":"SUM('Knights 2'!E83:E87)","v":0},{"$f":"SUM('Knights 2'!F83:F87)","v":0},{"$f":"SUM('Knights 2'!G83:G87)","v":0},{"$f":"SUM('Knights 2'!H83:H87)","v":0},{"$f":"SUM('Knights 2'!I83:I87)","v":0},{"$f":"SUM('Knights 2'!J83:J87)","v":0},{"$f":"SUM('Knights 2'!K83:K87)","v":0},{"$f":"SUM('Knights 2'!L83:L87)","v":0},{"$f":"SUM('Knights 2'!M83:M87)","v":0},{"$f":"SUM('Knights 2'!N83:N87)","v":0},{"$f":"SUM('Knights 2'!O83:O87)","v":0},{"$f":"SUM('Knights 2'!P83:P87)","v":0},{"$f":"SUM('Knights 2'!Q83:Q87)","v":0},{"$f":"SUM('Knights 2'!R83:R87)","v":0},null,{"$f":"SUM('Knights 2'!T83:T87)","v":0},{"$f":"SUM('Knights 2'!U83:U87)","v":0},{"$f":"SUM('Knights 2'!V83:V87)","v":0},null,{"$f":"IF(ISERROR(G93/D93),0,G93/D93)","v":0},{"$f":"IF(ISERROR((4*J93+3*I93+2*H93+G93-SUM(H93:J93))/D93),0,(4*J93+3*I93+2*H93+G93-SUM(H93:J93))/D93)","v":0},{"$f":"W93+X93","v":0},{"$f":"IF(ISERROR((G93+L93+M93)/(D93+L93+M93+Q93)),0,(G93+L93+M93)/(D93+L93+M93+Q93))","v":0},{"$f":"Z93+X93","v":0},null,{"$f":"IF(ISERROR((S93+T93)/(U93+S93+T93)),0,(S93+T93)/(U93+S93+T93))","v":0}]
[{"$f":"'Wesseling Vermins'!A63","v":313},{"$f":"IF('Wesseling Vermins'!B63=\"\",\"\",'Wesseling Vermins'!B63)","v":""},{"$f":"SUM('Wesseling Vermins'!D63:D67)","v":0},{"$f":"SUM('Wesseling Vermins'!E63:E67)","v":0},{"$f":"SUM('Wesseling Vermins'!F63:F67)","v":0},{"$f":"SUM('Wesseling Vermins'!G63:G67)","v":0},{"$f":"SUM('Wesseling Vermins'!H63:H67)","v":0},{"$f":"SUM('Wesseling Vermins'!I63:I67)","v":0},{"$f":"SUM('Wesseling Vermins'!J63:J67)","v":0},{"$f":"SUM('Wesseling Vermins'!K63:K67)","v":0},{"$f":"SUM('Wesseling Vermins'!L63:L67)","v":0},{"$f":"SUM('Wesseling Vermins'!M63:M67)","v":0},{"$f":"SUM('Wesseling Vermins'!N63:N67)","v":0},{"$f":"SUM('Wesseling Vermins'!O63:O67)","v":0},{"$f":"SUM('Wesseling Vermins'!P63:P67)","v":0},{"$f":"SUM('Wesseling Vermins'!Q63:Q67)","v":0},{"$f":"SUM('Wesseling Vermins'!R63:R67)","v":0},null,{"$f":"SUM('Wesseling Vermins'!T63:T67)","v":0},{"$f":"SUM('Wesseling Vermins'!U63:U67)","v":0},{"$f":"SUM('Wesseling Vermins'!V63:V67)","v":0},null,{"$f":"IF(ISERROR(G94/D94),0,G94/D94)","v":0},{"$f":"IF(ISERROR((4*J94+3*I94+2*H94+G94-SUM(H94:J94))/D94),0,(4*J94+3*I94+2*H94+G94-SUM(H94:J94))/D94)","v":0},{"$f":"W94+X94","v":0},{"$f":"IF(ISERROR((G94+L94+M94)/(D94+L94+M94+Q94)),0,(G94+L94+M94)/(D94+L94+M94+Q94))","v":0},{"$f":"Z94+X94","v":0},null,{"$f":"IF(ISERROR((S94+T94)/(U94+S94+T94)),0,(S94+T94)/(U94+S94+T94))","v":0}]
[{"$f":"'Wesseling Vermins'!A68","v":314},{"$f":"IF('Wesseling Vermins'!B68=\"\",\"\",'Wesseling Vermins'!B68)","v":""},{"$f":"SUM('Wesseling Vermins'!D68:D72)","v":0},{"$f":"SUM('Wesseling Vermins'!E68:E72)","v":0},{"$f":"SUM('Wesseling Vermins'!F68:F72)","v":0},{"$f":"SUM('Wesseling Vermins'!G68:G72)","v":0},{"$f":"SUM('Wesseling Vermins'!H68:H72)","v":0},{"$f":"SUM('Wesseling Vermins'!I68:I72)","v":0},{"$f":"SUM('Wesseling Vermins'!J68:J72)","v":0},{"$f":"SUM('Wesseling Vermins'!K68:K72)","v":0},{"$f":"SUM('Wesseling Vermins'!L68:L72)","v":0},{"$f":"SUM('Wesseling Vermins'!M68:M72)","v":0},{"$f":"SUM('Wesseling Vermins'!N68:N72)","v":0},{"$f":"SUM('Wesseling Vermins'!O68:O72)","v":0},{"$f":"SUM('Wesseling Vermins'!P68:P72)","v":0},{"$f":"SUM('Wesseling Vermins'!Q68:Q72)","v":0},{"$f":"SUM('Wesseling Vermins'!R68:R72)","v":0},null,{"$f":"SUM('Wesseling Vermins'!T68:T72)","v":0},{"$f":"SUM('Wesseling Vermins'!U68:U72)","v":0},{"$f":"SUM('Wesseling Vermins'!V68:V72)","v":0},null,{"$f":"IF(ISERROR(G95/D95),0,G95/D95)","v":0},{"$f":"IF(ISERROR((4*J95+3*I95+2*H95+G95-SUM(H95:J95))/D95),0,(4*J95+3*I95+2*H95+G95-SUM(H95:J95))/D95)","v":0},{"$f":"W95+X95","v":0},{"$f":"IF(ISERROR((G95+L95+M95)/(D95+L95+M95+Q95)),0,(G95+L95+M95)/(D95+L95+M95+Q95))","v":0},{"$f":"Z95+X95","v":0},null,{"$f":"IF(ISERROR((S95+T95)/(U95+S95+T95)),0,(S95+T95)/(U95+S95+T95))","v":0}]
[{"$f":"'Wesseling Vermins'!A73","v":315},{"$f":"IF('Wesseling Vermins'!B73=\"\",\"\",'Wesseling Vermins'!B73)","v":""},{"$f":"SUM('Wesseling Vermins'!D73:D77)","v":0},{"$f":"SUM('Wesseling Vermins'!E73:E77)","v":0},{"$f":"SUM('Wesseling Vermins'!F73:F77)","v":0},{"$f":"SUM('Wesseling Vermins'!G73:G77)","v":0},{"$f":"SUM('Wesseling Vermins'!H73:H77)","v":0},{"$f":"SUM('Wesseling Vermins'!I73:I77)","v":0},{"$f":"SUM('Wesseling Vermins'!J73:J77)","v":0},{"$f":"SUM('Wesseling Vermins'!K73:K77)","v":0},{"$f":"SUM('Wesseling Vermins'!L73:L77)","v":0},{"$f":"SUM('Wesseling Vermins'!M73:M77)","v":0},{"$f":"SUM('Wesseling Vermins'!N73:N77)","v":0},{"$f":"SUM('Wesseling Vermins'!O73:O77)","v":0},{"$f":"SUM('Wesseling Vermins'!P73:P77)","v":0},{"$f":"SUM('Wesseling Vermins'!Q73:Q77)","v":0},{"$f":"SUM('Wesseling Vermins'!R73:R77)","v":0},null,{"$f":"SUM('Wesseling Vermins'!T73:T77)","v":0},{"$f":"SUM('Wesseling Vermins'!U73:U77)","v":0},{"$f":"SUM('Wesseling Vermins'!V73:V77)","v":0},null,{"$f":"IF(ISERROR(G96/D96),0,G96/D96)","v":0},{"$f":"IF(ISERROR((4*J96+3*I96+2*H96+G96-SUM(H96:J96))/D96),0,(4*J96+3*I96+2*H96+G96-SUM(H96:J96))/D96)","v":0},{"$f":"W96+X96","v":0},{"$f":"IF(ISERROR((G96+L96+M96)/(D96+L96+M96+Q96)),0,(G96+L96+M96)/(D96+L96+M96+Q96))","v":0},{"$f":"Z96+X96","v":0},null,{"$f":"IF(ISERROR((S96+T96)/(U96+S96+T96)),0,(S96+T96)/(U96+S96+T96))","v":0}]
[{"$f":"'Wesseling Vermins'!A78","v":316},{"$f":"IF('Wesseling Vermins'!B78=\"\",\"\",'Wesseling Vermins'!B78)","v":""},{"$f":"SUM('Wesseling Vermins'!D78:D82)","v":0},{"$f":"SUM('Wesseling Vermins'!E78:E82)","v":0},{"$f":"SUM('Wesseling Vermins'!F78:F82)","v":0},{"$f":"SUM('Wesseling Vermins'!G78:G82)","v":0},{"$f":"SUM('Wesseling Vermins'!H78:H82)","v":0},{"$f":"SUM('Wesseling Vermins'!I78:I82)","v":0},{"$f":"SUM('Wesseling Vermins'!J78:J82)","v":0},{"$f":"SUM('Wesseling Vermins'!K78:K82)","v":0},{"$f":"SUM('Wesseling Vermins'!L78:L82)","v":0},{"$f":"SUM('Wesseling Vermins'!M78:M82)","v":0},{"$f":"SUM('Wesseling Vermins'!N78:N82)","v":0},{"$f":"SUM('Wesseling Vermins'!O78:O82)","v":0},{"$f":"SUM('Wesseling Vermins'!P78:P82)","v":0},{"$f":"SUM('Wesseling Vermins'!Q78:Q82)","v":0},{"$f":"SUM('Wesseling Vermins'!R78:R82)","v":0},null,{"$f":"SUM('Wesseling Vermins'!T78:T82)","v":0},{"$f":"SUM('Wesseling Vermins'!U78:U82)","v":0},{"$f":"SUM('Wesseling Vermins'!V78:V82)","v":0},null,{"$f":"IF(ISERROR(G97/D97),0,G97/D97)","v":0},{"$f":"IF(ISERROR((4*J97+3*I97+2*H97+G97-SUM(H97:J97))/D97),0,(4*J97+3*I97+2*H97+G97-SUM(H97:J97))/D97)","v":0},{"$f":"W97+X97","v":0},{"$f":"IF(ISERROR((G97+L97+M97)/(D97+L97+M97+Q97)),0,(G97+L97+M97)/(D97+L97+M97+Q97))","v":0},{"$f":"Z97+X97","v":0},null,{"$f":"IF(ISERROR((S97+T97)/(U97+S97+T97)),0,(S97+T97)/(U97+S97+T97))","v":0}]
[{"$f":"'Wesseling Vermins'!A83","v":317},{"$f":"IF('Wesseling Vermins'!B83=\"\",\"\",'Wesseling Vermins'!B83)","v":""},{"$f":"SUM('Wesseling Vermins'!D83:D87)","v":0},{"$f":"SUM('Wesseling Vermins'!E83:E87)","v":0},{"$f":"SUM('Wesseling Vermins'!F83:F87)","v":0},{"$f":"SUM('Wesseling Vermins'!G83:G87)","v":0},{"$f":"SUM('Wesseling Vermins'!H83:H87)","v":0},{"$f":"SUM('Wesseling Vermins'!I83:I87)","v":0},{"$f":"SUM('Wesseling Vermins'!J83:J87)","v":0},{"$f":"SUM('Wesseling Vermins'!K83:K87)","v":0},{"$f":"SUM('Wesseling Vermins'!L83:L87)","v":0},{"$f":"SUM('Wesseling Vermins'!M83:M87)","v":0},{"$f":"SUM('Wesseling Vermins'!N83:N87)","v":0},{"$f":"SUM('Wesseling Vermins'!O83:O87)","v":0},{"$f":"SUM('Wesseling Vermins'!P83:P87)","v":0},{"$f":"SUM('Wesseling Vermins'!Q83:Q87)","v":0},{"$f":"SUM('Wesseling Vermins'!R83:R87)","v":0},null,{"$f":"SUM('Wesseling Vermins'!T83:T87)","v":0},{"$f":"SUM('Wesseling Vermins'!U83:U87)","v":0},{"$f":"SUM('Wesseling Vermins'!V83:V87)","v":0},null,{"$f":"IF(ISERROR(G98/D98),0,G98/D98)","v":0},{"$f":"IF(ISERROR((4*J98+3*I98+2*H98+G98-SUM(H98:J98))/D98),0,(4*J98+3*I98+2*H98+G98-SUM(H98:J98))/D98)","v":0},{"$f":"W98+X98","v":0},{"$f":"IF(ISERROR((G98+L98+M98)/(D98+L98+M98+Q98)),0,(G98+L98+M98)/(D98+L98+M98+Q98))","v":0},{"$f":"Z98+X98","v":0},null,{"$f":"IF(ISERROR((S98+T98)/(U98+S98+T98)),0,(S98+T98)/(U98+S98+T98))","v":0}]
[{"$f":"'Freising Grizzlies'!A58","v":412},{"$f":"IF('Freising Grizzlies'!B58=\"\",\"\",'Freising Grizzlies'!B58)","v":"Schnirch"},{"$f":"SUM('Freising Grizzlies'!D58:D62)","v":0},{"$f":"SUM('Freising Grizzlies'!E58:E62)","v":0},{"$f":"SUM('Freising Grizzlies'!F58:F62)","v":0},{"$f":"SUM('Freising Grizzlies'!G58:G62)","v":0},{"$f":"SUM('Freising Grizzlies'!H58:H62)","v":0},{"$f":"SUM('Freising Grizzlies'!I58:I62)","v":0},{"$f":"SUM('Freising Grizzlies'!J58:J62)","v":0},{"$f":"SUM('Freising Grizzlies'!K58:K62)","v":0},{"$f":"SUM('Freising Grizzlies'!L58:L62)","v":0},{"$f":"SUM('Freising Grizzlies'!M58:M62)","v":0},{"$f":"SUM('Freising Grizzlies'!N58:N62)","v":0},{"$f":"SUM('Freising Grizzlies'!O58:O62)","v":0},{"$f":"SUM('Freising Grizzlies'!P58:P62)","v":0},{"$f":"SUM('Freising Grizzlies'!Q58:Q62)","v":0},{"$f":"SUM('Freising Grizzlies'!R58:R62)","v":0},null,{"$f":"SUM('Freising Grizzlies'!T58:T62)","v":0},{"$f":"SUM('Freising Grizzlies'!U58:U62)","v":2},{"$f":"SUM('Freising Grizzlies'!V58:V62)","v":1},null,{"$f":"IF(ISERROR(G99/D99),0,G99/D99)","v":0},{"$f":"IF(ISERROR((4*J99+3*I99+2*H99+G99-SUM(H99:J99))/D99),0,(4*J99+3*I99+2*H99+G99-SUM(H99:J99))/D99)","v":0},{"$f":"W99+X99","v":0},{"$f":"IF(ISERROR((G99+L99+M99)/(D99+L99+M99+Q99)),0,(G99+L99+M99)/(D99+L99+M99+Q99))","v":0},{"$f":"Z99+X99","v":0},null,{"$f":"IF(ISERROR((S99+T99)/(U99+S99+T99)),0,(S99+T99)/(U99+S99+T99))","v":0.66666666666666663}]
[{"$f":"'Freising Grizzlies'!A63","v":413},{"$f":"IF('Freising Grizzlies'!B63=\"\",\"\",'Freising Grizzlies'!B63)","v":""},{"$f":"SUM('Freising Grizzlies'!D63:D67)","v":0},{"$f":"SUM('Freising Grizzlies'!E63:E67)","v":0},{"$f":"SUM('Freising Grizzlies'!F63:F67)","v":0},{"$f":"SUM('Freising Grizzlies'!G63:G67)","v":0},{"$f":"SUM('Freising Grizzlies'!H63:H67)","v":0},{"$f":"SUM('Freising Grizzlies'!I63:I67)","v":0},{"$f":"SUM('Freising Grizzlies'!J63:J67)","v":0},{"$f":"SUM('Freising Grizzlies'!K63:K67)","v":0},{"$f":"SUM('Freising Grizzlies'!L63:L67)","v":0},{"$f":"SUM('Freising Grizzlies'!M63:M67)","v":0},{"$f":"SUM('Freising Grizzlies'!N63:N67)","v":0},{"$f":"SUM('Freising Grizzlies'!O63:O67)","v":0},{"$f":"SUM('Freising Grizzlies'!P63:P67)","v":0},{"$f":"SUM('Freising Grizzlies'!Q63:Q67)","v":0},{"$f":"SUM('Freising Grizzlies'!R63:R67)","v":0},null,{"$f":"SUM('Freising Grizzlies'!T63:T67)","v":0},{"$f":"SUM('Freising Grizzlies'!U63:U67)","v":0},{"$f":"SUM('Freising Grizzlies'!V63:V67)","v":0},null,{"$f":"IF(ISERROR(G100/D100),0,G100/D100)","v":0},{"$f":"IF(ISERROR((4*J100+3*I100+2*H100+G100-SUM(H100:J100))/D100),0,(4*J100+3*I100+2*H100+G100-SUM(H100:J100))/D100)","v":0},{"$f":"W100+X100","v":0},{"$f":"IF(ISERROR((G100+L100+M100)/(D100+L100+M100+Q100)),0,(G100+L100+M100)/(D100+L100+M100+Q100))","v":0},{"$f":"Z100+X100","v":0},null,{"$f":"IF(ISERROR((S100+T100)/(U100+S100+T100)),0,(S100+T100)/(U100+S100+T100))","v":0}]
[{"$f":"'Freising Grizzlies'!A68","v":414},{"$f":"IF('Freising Grizzlies'!B68=\"\",\"\",'Freising Grizzlies'!B68)","v":""},{"$f":"SUM('Freising Grizzlies'!D68:D72)","v":0},{"$f":"SUM('Freising Grizzlies'!E68:E72)","v":0},{"$f":"SUM('Freising Grizzlies'!F68:F72)","v":0},{"$f":"SUM('Freising Grizzlies'!G68:G72)","v":0},{"$f":"SUM('Freising Grizzlies'!H68:H72)","v":0},{"$f":"SUM('Freising Grizzlies'!I68:I72)","v":0},{"$f":"SUM('Freising Grizzlies'!J68:J72)","v":0},{"$f":"SUM('Freising Grizzlies'!K68:K72)","v":0},{"$f":"SUM('Freising Grizzlies'!L68:L72)","v":0},{"$f":"SUM('Freising Grizzlies'!M68:M72)","v":0},{"$f":"SUM('Freising Grizzlies'!N68:N72)","v":0},{"$f":"SUM('Freising Grizzlies'!O68:O72)","v":0},{"$f":"SUM('Freising Grizzlies'!P68:P72)","v":0},{"$f":"SUM('Freising Grizzlies'!Q68:Q72)","v":0},{"$f":"SUM('Freising Grizzlies'!R68:R72)","v":0},null,{"$f":"SUM('Freising Grizzlies'!T68:T72)","v":0},{"$f":"SUM('Freising Grizzlies'!U68:U72)","v":0},{"$f":"SUM('Freising Grizzlies'!V68:V72)","v":0},null,{"$f":"IF(ISERROR(G101/D101),0,G101/D101)","v":0},{"$f":"IF(ISERROR((4*J101+3*I101+2*H101+G101-SUM(H101:J101))/D101),0,(4*J101+3*I101+2*H101+G101-SUM(H101:J101))/D101)","v":0},{"$f":"W101+X101","v":0},{"$f":"IF(ISERROR((G101+L101+M101)/(D101+L101+M101+Q101)),0,(G101+L101+M101)/(D101+L101+M101+Q101))","v":0},{"$f":"Z101+X101","v":0},null,{"$f":"IF(ISERROR((S101+T101)/(U101+S101+T101)),0,(S101+T101)/(U101+S101+T101))","v":0}]
[{"$f":"'Freising Grizzlies'!A73","v":415},{"$f":"IF('Freising Grizzlies'!B73=\"\",\"\",'Freising Grizzlies'!B73)","v":""},{"$f":"SUM('Freising Grizzlies'!D73:D77)","v":0},{"$f":"SUM('Freising Grizzlies'!E73:E77)","v":0},{"$f":"SUM('Freising Grizzlies'!F73:F77)","v":0},{"$f":"SUM('Freising Grizzlies'!G73:G77)","v":0},{"$f":"SUM('Freising Grizzlies'!H73:H77)","v":0},{"$f":"SUM('Freising Grizzlies'!I73:I77)","v":0},{"$f":"SUM('Freising Grizzlies'!J73:J77)","v":0},{"$f":"SUM('Freising Grizzlies'!K73:K77)","v":0},{"$f":"SUM('Freising Grizzlies'!L73:L77)","v":0},{"$f":"SUM('Freising Grizzlies'!M73:M77)","v":0},{"$f":"SUM('Freising Grizzlies'!N73:N77)","v":0},{"$f":"SUM('Freising Grizzlies'!O73:O77)","v":0},{"$f":"SUM('Freising Grizzlies'!P73:P77)","v":0},{"$f":"SUM('Freising Grizzlies'!Q73:Q77)","v":0},{"$f":"SUM('Freising Grizzlies'!R73:R77)","v":0},null,{"$f":"SUM('Freising Grizzlies'!T73:T77)","v":0},{"$f":"SUM('Freising Grizzlies'!U73:U77)","v":0},{"$f":"SUM('Freising Grizzlies'!V73:V77)","v":0},null,{"$f":"IF(ISERROR(G102/D102),0,G102/D102)","v":0},{"$f":"IF(ISERROR((4*J102+3*I102+2*H102+G102-SUM(H102:J102))/D102),0,(4*J102+3*I102+2*H102+G102-SUM(H102:J102))/D102)","v":0},{"$f":"W102+X102","v":0},{"$f":"IF(ISERROR((G102+L102+M102)/(D102+L102+M102+Q102)),0,(G102+L102+M102)/(D102+L102+M102+Q102))","v":0},{"$f":"Z102+X102","v":0},null,{"$f":"IF(ISERROR((S102+T102)/(U102+S102+T102)),0,(S102+T102)/(U102+S102+T102))","v":0}]
[{"$f":"'Freising Grizzlies'!A78","v":416},{"$f":"IF('Freising Grizzlies'!B78=\"\",\"\",'Freising Grizzlies'!B78)","v":""},{"$f":"SUM('Freising Grizzlies'!D78:D82)","v":0},{"$f":"SUM('Freising Grizzlies'!E78:E82)","v":0},{"$f":"SUM('Freising Grizzlies'!F78:F82)","v":0},{"$f":"SUM('Freising Grizzlies'!G78:G82)","v":0},{"$f":"SUM('Freising Grizzlies'!H78:H82)","v":0},{"$f":"SUM('Freising Grizzlies'!I78:I82)","v":0},{"$f":"SUM('Freising Grizzlies'!J78:J82)","v":0},{"$f":"SUM('Freising Grizzlies'!K78:K82)","v":0},{"$f":"SUM('Freising Grizzlies'!L78:L82)","v":0},{"$f":"SUM('Freising Grizzlies'!M78:M82)","v":0},{"$f":"SUM('Freising Grizzlies'!N78:N82)","v":0},{"$f":"SUM('Freising Grizzlies'!O78:O82)","v":0},{"$f":"SUM('Freising Grizzlies'!P78:P82)","v":0},{"$f":"SUM('Freising Grizzlies'!Q78:Q82)","v":0},{"$f":"SUM('Freising Grizzlies'!R78:R82)","v":0},null,{"$f":"SUM('Freising Grizzlies'!T78:T82)","v":0},{"$f":"SUM('Freising Grizzlies'!U78:U82)","v":0},{"$f":"SUM('Freising Grizzlies'!V78:V82)","v":0},null,{"$f":"IF(ISERROR(G103/D103),0,G103/D103)","v":0},{"$f":"IF(ISERROR((4*J103+3*I103+2*H103+G103-SUM(H103:J103))/D103),0,(4*J103+3*I103+2*H103+G103-SUM(H103:J103))/D103)","v":0},{"$f":"W103+X103","v":0},{"$f":"IF(ISERROR((G103+L103+M103)/(D103+L103+M103+Q103)),0,(G103+L103+M103)/(D103+L103+M103+Q103))","v":0},{"$f":"Z103+X103","v":0},null,{"$f":"IF(ISERROR((S103+T103)/(U103+S103+T103)),0,(S103+T103)/(U103+S103+T103))","v":0}]
[{"$f":"'Freising Grizzlies'!A83","v":417},{"$f":"IF('Freising Grizzlies'!B83=\"\",\"\",'Freising Grizzlies'!B83)","v":""},{"$f":"SUM('Freising Grizzlies'!D83:D87)","v":0},{"$f":"SUM('Freising Grizzlies'!E83:E87)","v":0},{"$f":"SUM('Freising Grizzlies'!F83:F87)","v":0},{"$f":"SUM('Freising Grizzlies'!G83:G87)","v":0},{"$f":"SUM('Freising Grizzlies'!H83:H87)","v":0},{"$f":"SUM('Freising Grizzlies'!I83:I87)","v":0},{"$f":"SUM('Freising Grizzlies'!J83:J87)","v":0},{"$f":"SUM('Freising Grizzlies'!K83:K87)","v":0},{"$f":"SUM('Freising Grizzlies'!L83:L87)","v":0},{"$f":"SUM('Freising Grizzlies'!M83:M87)","v":0},{"$f":"SUM('Freising Grizzlies'!N83:N87)","v":0},{"$f":"SUM('Freising Grizzlies'!O83:O87)","v":0},{"$f":"SUM('Freising Grizzlies'!P83:P87)","v":0},{"$f":"SUM('Freising Grizzlies'!Q83:Q87)","v":0},{"$f":"SUM('Freising Grizzlies'!R83:R87)","v":0},null,{"$f":"SUM('Freising Grizzlies'!T83:T87)","v":0},{"$f":"SUM('Freising Grizzlies'!U83:U87)","v":0},{"$f":"SUM('Freising Grizzlies'!V83:V87)","v":0},null,{"$f":"IF(ISERROR(G104/D104),0,G104/D104)","v":0},{"$f":"IF(ISERROR((4*J104+3*I104+2*H104+G104-SUM(H104:J104))/D104),0,(4*J104+3*I104+2*H104+G104-SUM(H104:J104))/D104)","v":0},{"$f":"W104+X104","v":0},{"$f":"IF(ISERROR((G104+L104+M104)/(D104+L104+M104+Q104)),0,(G104+L104+M104)/(D104+L104+M104+Q104))","v":0},{"$f":"Z104+X104","v":0},null,{"$f":"IF(ISERROR((S104+T104)/(U104+S104+T104)),0,(S104+T104)/(U104+S104+T104))","v":0}]
[{"$f":"'Haar Disciples'!A83","v":517},{"$f":"IF('Haar Disciples'!B83=\"\",\"\",'Haar Disciples'!B83)","v":""},{"$f":"SUM('Haar Disciples'!D83:D87)","v":0},{"$f":"SUM('Haar Disciples'!E83:E87)","v":0},{"$f":"SUM('Haar Disciples'!F83:F87)","v":0},{"$f":"SUM('Haar Disciples'!G83:G87)","v":0},{"$f":"SUM('Haar Disciples'!H83:H87)","v":0},{"$f":"SUM('Haar Disciples'!I83:I87)","v":0},{"$f":"SUM('Haar Disciples'!J83:J87)","v":0},{"$f":"SUM('Haar Disciples'!K83:K87)","v":0},{"$f":"SUM('Haar Disciples'!L83:L87)","v":0},{"$f":"SUM('Haar Disciples'!M83:M87)","v":0},{"$f":"SUM('Haar Disciples'!N83:N87)","v":0},{"$f":"SUM('Haar Disciples'!O83:O87)","v":0},{"$f":"SUM('Haar Disciples'!P83:P87)","v":0},{"$f":"SUM('Haar Disciples'!Q83:Q87)","v":0},{"$f":"SUM('Haar Disciples'!R83:R87)","v":0},null,{"$f":"SUM('Haar Disciples'!T83:T87)","v":0},{"$f":"SUM('Haar Disciples'!U83:U87)","v":0},{"$f":"SUM('Haar Disciples'!V83:V87)","v":0},null,{"$f":"IF(ISERROR(G105/D105),0,G105/D105)","v":0},{"$f":"IF(ISERROR((4*J105+3*I105+2*H105+G105-SUM(H105:J105))/D105),0,(4*J105+3*I105+2*H105+G105-SUM(H105:J105))/D105)","v":0},{"$f":"W105+X105","v":0},{"$f":"IF(ISERROR((G105+L105+M105)/(D105+L105+M105+Q105)),0,(G105+L105+M105)/(D105+L105+M105+Q105))","v":0},{"$f":"Z105+X105","v":0},null,{"$f":"IF(ISERROR((S105+T105)/(U105+S105+T105)),0,(S105+T105)/(U105+S105+T105))","v":0}]
[{"$f":"'Knights 2'!A18","v":600},{"$f":"IF('Knights 2'!B18=\"\",\"\",'Knights 2'!B18)","v":""},{"$f":"SUM('Knights 2'!D18:D22)","v":0},{"$f":"SUM('Knights 2'!E18:E22)","v":0},{"$f":"SUM('Knights 2'!F18:F22)","v":0},{"$f":"SUM('Knights 2'!G18:G22)","v":0},{"$f":"SUM('Knights 2'!H18:H22)","v":0},{"$f":"SUM('Knights 2'!I18:I22)","v":0},{"$f":"SUM('Knights 2'!J18:J22)","v":0},{"$f":"SUM('Knights 2'!K18:K22)","v":0},{"$f":"SUM('Knights 2'!L18:L22)","v":0},{"$f":"SUM('Knights 2'!M18:M22)","v":0},{"$f":"SUM('Knights 2'!N18:N22)","v":0},{"$f":"SUM('Knights 2'!O18:O22)","v":0},{"$f":"SUM('Knights 2'!P18:P22)","v":0},{"$f":"SUM('Knights 2'!Q18:Q22)","v":0},{"$f":"SUM('Knights 2'!R18:R22)","v":0},null,{"$f":"SUM('Knights 2'!T18:T22)","v":0},{"$f":"SUM('Knights 2'!U18:U22)","v":0},{"$f":"SUM('Knights 2'!V18:V22)","v":0},null,{"$f":"IF(ISERROR(G106/D106),0,G106/D106)","v":0},{"$f":"IF(ISERROR((4*J106+3*I106+2*H106+G106-SUM(H106:J106))/D106),0,(4*J106+3*I106+2*H106+G106-SUM(H106:J106))/D106)","v":0},{"$f":"W106+X106","v":0},{"$f":"IF(ISERROR((G106+L106+M106)/(D106+L106+M106+Q106)),0,(G106+L106+M106)/(D106+L106+M106+Q106))","v":0},{"$f":"Z106+X106","v":0},null,{"$f":"IF(ISERROR((S106+T106)/(U106+S106+T106)),0,(S106+T106)/(U106+S106+T106))","v":0}]
[{"$f":"'Karlsruhe Cougars'!A53","v":611},{"$f":"IF('Karlsruhe Cougars'!B53=\"\",\"\",'Karlsruhe Cougars'!B53)","v":""},{"$f":"SUM('Karlsruhe Cougars'!D53:D57)","v":0},{"$f":"SUM('Karlsruhe Cougars'!E53:E57)","v":0},{"$f":"SUM('Karlsruhe Cougars'!F53:F57)","v":0},{"$f":"SUM('Karlsruhe Cougars'!G53:G57)","v":0},{"$f":"SUM('Karlsruhe Cougars'!H53:H57)","v":0},{"$f":"SUM('Karlsruhe Cougars'!I53:I57)","v":0},{"$f":"SUM('Karlsruhe Cougars'!J53:J57)","v":0},{"$f":"SUM('Karlsruhe Cougars'!K53:K57)","v":0},{"$f":"SUM('Karlsruhe Cougars'!L53:L57)","v":0},{"$f":"SUM('Karlsruhe Cougars'!M53:M57)","v":0},{"$f":"SUM('Karlsruhe Cougars'!N53:N57)","v":0},{"$f":"SUM('Karlsruhe Cougars'!O53:O57)","v":0},{"$f":"SUM('Karlsruhe Cougars'!P53:P57)","v":0},{"$f":"SUM('Karlsruhe Cougars'!Q53:Q57)","v":0},{"$f":"SUM('Karlsruhe Cougars'!R53:R57)","v":0},null,{"$f":"SUM('Karlsruhe Cougars'!T53:T57)","v":0},{"$f":"SUM('Karlsruhe Cougars'!U53:U57)","v":0},{"$f":"SUM('Karlsruhe Cougars'!V53:V57)","v":0},null,{"$f":"IF(ISERROR(G107/D107),0,G107/D107)","v":0},{"$f":"IF(ISERROR((4*J107+3*I107+2*H107+G107-SUM(H107:J107))/D107),0,(4*J107+3*I107+2*H107+G107-SUM(H107:J107))/D107)","v":0},{"$f":"W107+X107","v":0},{"$f":"IF(ISERROR((G107+L107+M107)/(D107+L107+M107+Q107)),0,(G107+L107+M107)/(D107+L107+M107+Q107))","v":0},{"$f":"Z107+X107","v":0},null,{"$f":"IF(ISERROR((S107+T107)/(U107+S107+T107)),0,(S107+T107)/(U107+S107+T107))","v":0}]
[{"$f":"'Karlsruhe Cougars'!A58","v":612},{"$f":"IF('Karlsruhe Cougars'!B58=\"\",\"\",'Karlsruhe Cougars'!B58)","v":""},{"$f":"SUM('Karlsruhe Cougars'!D58:D62)","v":0},{"$f":"SUM('Karlsruhe Cougars'!E58:E62)","v":0},{"$f":"SUM('Karlsruhe Cougars'!F58:F62)","v":0},{"$f":"SUM('Karlsruhe Cougars'!G58:G62)","v":0},{"$f":"SUM('Karlsruhe Cougars'!H58:H62)","v":0},{"$f":"SUM('Karlsruhe Cougars'!I58:I62)","v":0},{"$f":"SUM('Karlsruhe Cougars'!J58:J62)","v":0},{"$f":"SUM('Karlsruhe Cougars'!K58:K62)","v":0},{"$f":"SUM('Karlsruhe Cougars'!L58:L62)","v":0},{"$f":"SUM('Karlsruhe Cougars'!M58:M62)","v":0},{"$f":"SUM('Karlsruhe Cougars'!N58:N62)","v":0},{"$f":"SUM('Karlsruhe Cougars'!O58:O62)","v":0},{"$f":"SUM('Karlsruhe Cougars'!P58:P62)","v":0},{"$f":"SUM('Karlsruhe Cougars'!Q58:Q62)","v":0},{"$f":"SUM('Karlsruhe Cougars'!R58:R62)","v":0},null,{"$f":"SUM('Karlsruhe Cougars'!T58:T62)","v":0},{"$f":"SUM('Karlsruhe Cougars'!U58:U62)","v":0},{"$f":"SUM('Karlsruhe Cougars'!V58:V62)","v":0},null,{"$f":"IF(ISERROR(G108/D108),0,G108/D108)","v":0},{"$f":"IF(ISERROR((4*J108+3*I108+2*H108+G108-SUM(H108:J108))/D108),0,(4*J108+3*I108+2*H108+G108-SUM(H108:J108))/D108)","v":0},{"$f":"W108+X108","v":0},{"$f":"IF(ISERROR((G108+L108+M108)/(D108+L108+M108+Q108)),0,(G108+L108+M108)/(D108+L108+M108+Q108))","v":0},{"$f":"Z108+X108","v":0},null,{"$f":"IF(ISERROR((S108+T108)/(U108+S108+T108)),0,(S108+T108)/(U108+S108+T108))","v":0}]
[{"$f":"'Karlsruhe Cougars'!A63","v":613},{"$f":"IF('Karlsruhe Cougars'!B63=\"\",\"\",'Karlsruhe Cougars'!B63)","v":""},{"$f":"SUM('Karlsruhe Cougars'!D63:D67)","v":0},{"$f":"SUM('Karlsruhe Cougars'!E63:E67)","v":0},{"$f":"SUM('Karlsruhe Cougars'!F63:F67)","v":0},{"$f":"SUM('Karlsruhe Cougars'!G63:G67)","v":0},{"$f":"SUM('Karlsruhe Cougars'!H63:H67)","v":0},{"$f":"SUM('Karlsruhe Cougars'!I63:I67)","v":0},{"$f":"SUM('Karlsruhe Cougars'!J63:J67)","v":0},{"$f":"SUM('Karlsruhe Cougars'!K63:K67)","v":0},{"$f":"SUM('Karlsruhe Cougars'!L63:L67)","v":0},{"$f":"SUM('Karlsruhe Cougars'!M63:M67)","v":0},{"$f":"SUM('Karlsruhe Cougars'!N63:N67)","v":0},{"$f":"SUM('Karlsruhe Cougars'!O63:O67)","v":0},{"$f":"SUM('Karlsruhe Cougars'!P63:P67)","v":0},{"$f":"SUM('Karlsruhe Cougars'!Q63:Q67)","v":0},{"$f":"SUM('Karlsruhe Cougars'!R63:R67)","v":0},null,{"$f":"SUM('Karlsruhe Cougars'!T63:T67)","v":0},{"$f":"SUM('Karlsruhe Cougars'!U63:U67)","v":0},{"$f":"SUM('Karlsruhe Cougars'!V63:V67)","v":0},null,{"$f":"IF(ISERROR(G109/D109),0,G109/D109)","v":0},{"$f":"IF(ISERROR((4*J109+3*I109+2*H109+G109-SUM(H109:J109))/D109),0,(4*J109+3*I109+2*H109+G109-SUM(H109:J109))/D109)","v":0},{"$f":"W109+X109","v":0},{"$f":"IF(ISERROR((G109+L109+M109)/(D109+L109+M109+Q109)),0,(G109+L109+M109)/(D109+L109+M109+Q109))","v":0},{"$f":"Z109+X109","v":0},null,{"$f":"IF(ISERROR((S109+T109)/(U109+S109+T109)),0,(S109+T109)/(U109+S109+T109))","v":0}]
[{"$f":"'Karlsruhe Cougars'!A68","v":614},{"$f":"IF('Karlsruhe Cougars'!B68=\"\",\"\",'Karlsruhe Cougars'!B68)","v":""},{"$f":"SUM('Karlsruhe Cougars'!D68:D72)","v":0},{"$f":"SUM('Karlsruhe Cougars'!E68:E72)","v":0},{"$f":"SUM('Karlsruhe Cougars'!F68:F72)","v":0},{"$f":"SUM('Karlsruhe Cougars'!G68:G72)","v":0},{"$f":"SUM('Karlsruhe Cougars'!H68:H72)","v":0},{"$f":"SUM('Karlsruhe Cougars'!I68:I72)","v":0},{"$f":"SUM('Karlsruhe Cougars'!J68:J72)","v":0},{"$f":"SUM('Karlsruhe Cougars'!K68:K72)","v":0},{"$f":"SUM('Karlsruhe Cougars'!L68:L72)","v":0},{"$f":"SUM('Karlsruhe Cougars'!M68:M72)","v":0},{"$f":"SUM('Karlsruhe Cougars'!N68:N72)","v":0},{"$f":"SUM('Karlsruhe Cougars'!O68:O72)","v":0},{"$f":"SUM('Karlsruhe Cougars'!P68:P72)","v":0},{"$f":"SUM('Karlsruhe Cougars'!Q68:Q72)","v":0},{"$f":"SUM('Karlsruhe Cougars'!R68:R72)","v":0},null,{"$f":"SUM('Karlsruhe Cougars'!T68:T72)","v":0},{"$f":"SUM('Karlsruhe Cougars'!U68:U72)","v":0},{"$f":"SUM('Karlsruhe Cougars'!V68:V72)","v":0},null,{"$f":"IF(ISERROR(G110/D110),0,G110/D110)","v":0},{"$f":"IF(ISERROR((4*J110+3*I110+2*H110+G110-SUM(H110:J110))/D110),0,(4*J110+3*I110+2*H110+G110-SUM(H110:J110))/D110)","v":0},{"$f":"W110+X110","v":0},{"$f":"IF(ISERROR((G110+L110+M110)/(D110+L110+M110+Q110)),0,(G110+L110+M110)/(D110+L110+M110+Q110))","v":0},{"$f":"Z110+X110","v":0},null,{"$f":"IF(ISERROR((S110+T110)/(U110+S110+T110)),0,(S110+T110)/(U110+S110+T110))","v":0}]
[{"$f":"'Karlsruhe Cougars'!A73","v":615},{"$f":"IF('Karlsruhe Cougars'!B73=\"\",\"\",'Karlsruhe Cougars'!B73)","v":""},{"$f":"SUM('Karlsruhe Cougars'!D73:D77)","v":0},{"$f":"SUM('Karlsruhe Cougars'!E73:E77)","v":0},{"$f":"SUM('Karlsruhe Cougars'!F73:F77)","v":0},{"$f":"SUM('Karlsruhe Cougars'!G73:G77)","v":0},{"$f":"SUM('Karlsruhe Cougars'!H73:H77)","v":0},{"$f":"SUM('Karlsruhe Cougars'!I73:I77)","v":0},{"$f":"SUM('Karlsruhe Cougars'!J73:J77)","v":0},{"$f":"SUM('Karlsruhe Cougars'!K73:K77)","v":0},{"$f":"SUM('Karlsruhe Cougars'!L73:L77)","v":0},{"$f":"SUM('Karlsruhe Cougars'!M73:M77)","v":0},{"$f":"SUM('Karlsruhe Cougars'!N73:N77)","v":0},{"$f":"SUM('Karlsruhe Cougars'!O73:O77)","v":0},{"$f":"SUM('Karlsruhe Cougars'!P73:P77)","v":0},{"$f":"SUM('Karlsruhe Cougars'!Q73:Q77)","v":0},{"$f":"SUM('Karlsruhe Cougars'!R73:R77)","v":0},null,{"$f":"SUM('Karlsruhe Cougars'!T73:T77)","v":0},{"$f":"SUM('Karlsruhe Cougars'!U73:U77)","v":0},{"$f":"SUM('Karlsruhe Cougars'!V73:V77)","v":0},null,{"$f":"IF(ISERROR(G111/D111),0,G111/D111)","v":0},{"$f":"IF(ISERROR((4*J111+3*I111+2*H111+G111-SUM(H111:J111))/D111),0,(4*J111+3*I111+2*H111+G111-SUM(H111:J111))/D111)","v":0},{"$f":"W111+X111","v":0},{"$f":"IF(ISERROR((G111+L111+M111)/(D111+L111+M111+Q111)),0,(G111+L111+M111)/(D111+L111+M111+Q111))","v":0},{"$f":"Z111+X111","v":0},null,{"$f":"IF(ISERROR((S111+T111)/(U111+S111+T111)),0,(S111+T111)/(U111+S111+T111))","v":0}]
[{"$f":"'Karlsruhe Cougars'!A78","v":616},{"$f":"IF('Karlsruhe Cougars'!B78=\"\",\"\",'Karlsruhe Cougars'!B78)","v":""},{"$f":"SUM('Karlsruhe Cougars'!D78:D82)","v":0},{"$f":"SUM('Karlsruhe Cougars'!E78:E82)","v":0},{"$f":"SUM('Karlsruhe Cougars'!F78:F82)","v":0},{"$f":"SUM('Karlsruhe Cougars'!G78:G82)","v":0},{"$f":"SUM('Karlsruhe Cougars'!H78:H82)","v":0},{"$f":"SUM('Karlsruhe Cougars'!I78:I82)","v":0},{"$f":"SUM('Karlsruhe Cougars'!J78:J82)","v":0},{"$f":"SUM('Karlsruhe Cougars'!K78:K82)","v":0},{"$f":"SUM('Karlsruhe Cougars'!L78:L82)","v":0},{"$f":"SUM('Karlsruhe Cougars'!M78:M82)","v":0},{"$f":"SUM('Karlsruhe Cougars'!N78:N82)","v":0},{"$f":"SUM('Karlsruhe Cougars'!O78:O82)","v":0},{"$f":"SUM('Karlsruhe Cougars'!P78:P82)","v":0},{"$f":"SUM('Karlsruhe Cougars'!Q78:Q82)","v":0},{"$f":"SUM('Karlsruhe Cougars'!R78:R82)","v":0},null,{"$f":"SUM('Karlsruhe Cougars'!T78:T82)","v":0},{"$f":"SUM('Karlsruhe Cougars'!U78:U82)","v":0},{"$f":"SUM('Karlsruhe Cougars'!V78:V82)","v":0},null,{"$f":"IF(ISERROR(G112/D112),0,G112/D112)","v":0},{"$f":"IF(ISERROR((4*J112+3*I112+2*H112+G112-SUM(H112:J112))/D112),0,(4*J112+3*I112+2*H112+G112-SUM(H112:J112))/D112)","v":0},{"$f":"W112+X112","v":0},{"$f":"IF(ISERROR((G112+L112+M112)/(D112+L112+M112+Q112)),0,(G112+L112+M112)/(D112+L112+M112+Q112))","v":0},{"$f":"Z112+X112","v":0},null,{"$f":"IF(ISERROR((S112+T112)/(U112+S112+T112)),0,(S112+T112)/(U112+S112+T112))","v":0}]
[{"$f":"'Karlsruhe Cougars'!A83","v":617},{"$f":"IF('Karlsruhe Cougars'!B83=\"\",\"\",'Karlsruhe Cougars'!B83)","v":""},{"$f":"SUM('Karlsruhe Cougars'!D83:D87)","v":0},{"$f":"SUM('Karlsruhe Cougars'!E83:E87)","v":0},{"$f":"SUM('Karlsruhe Cougars'!F83:F87)","v":0},{"$f":"SUM('Karlsruhe Cougars'!G83:G87)","v":0},{"$f":"SUM('Karlsruhe Cougars'!H83:H87)","v":0},{"$f":"SUM('Karlsruhe Cougars'!I83:I87)","v":0},{"$f":"SUM('Karlsruhe Cougars'!J83:J87)","v":0},{"$f":"SUM('Karlsruhe Cougars'!K83:K87)","v":0},{"$f":"SUM('Karlsruhe Cougars'!L83:L87)","v":0},{"$f":"SUM('Karlsruhe Cougars'!M83:M87)","v":0},{"$f":"SUM('Karlsruhe Cougars'!N83:N87)","v":0},{"$f":"SUM('Karlsruhe Cougars'!O83:O87)","v":0},{"$f":"SUM('Karlsruhe Cougars'!P83:P87)","v":0},{"$f":"SUM('Karlsruhe Cougars'!Q83:Q87)","v":0},{"$f":"SUM('Karlsruhe Cougars'!R83:R87)","v":0},null,{"$f":"SUM('Karlsruhe Cougars'!T83:T87)","v":0},{"$f":"SUM('Karlsruhe Cougars'!U83:U87)","v":0},{"$f":"SUM('Karlsruhe Cougars'!V83:V87)","v":0},null,{"$f":"IF(ISERROR(G113/D113),0,G113/D113)","v":0},{"$f":"IF(ISERROR((4*J113+3*I113+2*H113+G113-SUM(H113:J113))/D113),0,(4*J113+3*I113+2*H113+G113-SUM(H113:J113))/D113)","v":0},{"$f":"W113+X113","v":0},{"$f":"IF(ISERROR((G113+L113+M113)/(D113+L113+M113+Q113)),0,(G113+L113+M113)/(D113+L113+M113+Q113))","v":0},{"$f":"Z113+X113","v":0},null,{"$f":"IF(ISERROR((S113+T113)/(U113+S113+T113)),0,(S113+T113)/(U113+S113+T113))","v":0}]
[{"$f":"'Neunkirchen Nightmares'!A48","v":710},{"$f":"IF('Neunkirchen Nightmares'!B48=\"\",\"\",'Neunkirchen Nightmares'!B48)","v":""},{"$f":"SUM('Neunkirchen Nightmares'!D48:D52)","v":0},{"$f":"SUM('Neunkirchen Nightmares'!E48:E52)","v":0},{"$f":"SUM('Neunkirchen Nightmares'!F48:F52)","v":0},{"$f":"SUM('Neunkirchen Nightmares'!G48:G52)","v":0},{"$f":"SUM('Neunkirchen Nightmares'!H48:H52)","v":0},{"$f":"SUM('Neunkirchen Nightmares'!I48:I52)","v":0},{"$f":"SUM('Neunkirchen Nightmares'!J48:J52)","v":0},{"$f":"SUM('Neunkirchen Nightmares'!K48:K52)","v":0},{"$f":"SUM('Neunkirchen Nightmares'!L48:L52)","v":0},{"$f":"SUM('Neunkirchen Nightmares'!M48:M52)","v":0},{"$f":"SUM('Neunkirchen Nightmares'!N48:N52)","v":0},{"$f":"SUM('Neunkirchen Nightmares'!O48:O52)","v":0},{"$f":"SUM('Neunkirchen Nightmares'!P48:P52)","v":0},{"$f":"SUM('Neunkirchen Nightmares'!Q48:Q52)","v":0},{"$f":"SUM('Neunkirchen Nightmares'!R48:R52)","v":0},null,{"$f":"SUM('Neunkirchen Nightmares'!T48:T52)","v":0},{"$f":"SUM('Neunkirchen Nightmares'!U48:U52)","v":0},{"$f":"SUM('Neunkirchen Nightmares'!V48:V52)","v":0},null,{"$f":"IF(ISERROR(G114/D114),0,G114/D114)","v":0},{"$f":"IF(ISERROR((4*J114+3*I114+2*H114+G114-SUM(H114:J114))/D114),0,(4*J114+3*I114+2*H114+G114-SUM(H114:J114))/D114)","v":0},{"$f":"W114+X114","v":0},{"$f":"IF(ISERROR((G114+L114+M114)/(D114+L114+M114+Q114)),0,(G114+L114+M114)/(D114+L114+M114+Q114))","v":0},{"$f":"Z114+X114","v":0},null,{"$f":"IF(ISERROR((S114+T114)/(U114+S114+T114)),0,(S114+T114)/(U114+S114+T114))","v":0}]
[{"$f":"'Neunkirchen Nightmares'!A53","v":711},{"$f":"IF('Neunkirchen Nightmares'!B53=\"\",\"\",'Neunkirchen Nightmares'!B53)","v":""},{"$f":"SUM('Neunkirchen Nightmares'!D53:D57)","v":0},{"$f":"SUM('Neunkirchen Nightmares'!E53:E57)","v":0},{"$f":"SUM('Neunkirchen Nightmares'!F53:F57)","v":0},{"$f":"SUM('Neunkirchen Nightmares'!G53:G57)","v":0},{"$f":"SUM('Neunkirchen Nightmares'!H53:H57)","v":0},{"$f":"SUM('Neunkirchen Nightmares'!I53:I57)","v":0},{"$f":"SUM('Neunkirchen Nightmares'!J53:J57)","v":0},{"$f":"SUM('Neunkirchen Nightmares'!K53:K57)","v":0},{"$f":"SUM('Neunkirchen Nightmares'!L53:L57)","v":0},{"$f":"SUM('Neunkirchen Nightmares'!M53:M57)","v":0},{"$f":"SUM('Neunkirchen Nightmares'!N53:N57)","v":0},{"$f":"SUM('Neunkirchen Nightmares'!O53:O57)","v":0},{"$f":"SUM('Neunkirchen Nightmares'!P53:P57)","v":0},{"$f":"SUM('Neunkirchen Nightmares'!Q53:Q57)","v":0},{"$f":"SUM('Neunkirchen Nightmares'!R53:R57)","v":0},null,{"$f":"SUM('Neunkirchen Nightmares'!T53:T57)","v":0},{"$f":"SUM('Neunkirchen Nightmares'!U53:U57)","v":0},{"$f":"SUM('Neunkirchen Nightmares'!V53:V57)","v":0},null,{"$f":"IF(ISERROR(G115/D115),0,G115/D115)","v":0},{"$f":"IF(ISERROR((4*J115+3*I115+2*H115+G115-SUM(H115:J115))/D115),0,(4*J115+3*I115+2*H115+G115-SUM(H115:J115))/D115)","v":0},{"$f":"W115+X115","v":0},{"$f":"IF(ISERROR((G115+L115+M115)/(D115+L115+M115+Q115)),0,(G115+L115+M115)/(D115+L115+M115+Q115))","v":0},{"$f":"Z115+X115","v":0},null,{"$f":"IF(ISERROR((S115+T115)/(U115+S115+T115)),0,(S115+T115)/(U115+S115+T115))","v":0}]
[{"$f":"'Neunkirchen Nightmares'!A58","v":712},{"$f":"IF('Neunkirchen Nightmares'!B58=\"\",\"\",'Neunkirchen Nightmares'!B58)","v":""},{"$f":"SUM('Neunkirchen Nightmares'!D58:D62)","v":0},{"$f":"SUM('Neunkirchen Nightmares'!E58:E62)","v":0},{"$f":"SUM('Neunkirchen Nightmares'!F58:F62)","v":0},{"$f":"SUM('Neunkirchen Nightmares'!G58:G62)","v":0},{"$f":"SUM('Neunkirchen Nightmares'!H58:H62)","v":0},{"$f":"SUM('Neunkirchen Nightmares'!I58:I62)","v":0},{"$f":"SUM('Neunkirchen Nightmares'!J58:J62)","v":0},{"$f":"SUM('Neunkirchen Nightmares'!K58:K62)","v":0},{"$f":"SUM('Neunkirchen Nightmares'!L58:L62)","v":0},{"$f":"SUM('Neunkirchen Nightmares'!M58:M62)","v":0},{"$f":"SUM('Neunkirchen Nightmares'!N58:N62)","v":0},{"$f":"SUM('Neunkirchen Nightmares'!O58:O62)","v":0},{"$f":"SUM('Neunkirchen Nightmares'!P58:P62)","v":0},{"$f":"SUM('Neunkirchen Nightmares'!Q58:Q62)","v":0},{"$f":"SUM('Neunkirchen Nightmares'!R58:R62)","v":0},null,{"$f":"SUM('Neunkirchen Nightmares'!T58:T62)","v":0},{"$f":"SUM('Neunkirchen Nightmares'!U58:U62)","v":0},{"$f":"SUM('Neunkirchen Nightmares'!V58:V62)","v":0},null,{"$f":"IF(ISERROR(G116/D116),0,G116/D116)","v":0},{"$f":"IF(ISERROR((4*J116+3*I116+2*H116+G116-SUM(H116:J116))/D116),0,(4*J116+3*I116+2*H116+G116-SUM(H116:J116))/D116)","v":0},{"$f":"W116+X116","v":0},{"$f":"IF(ISERROR((G116+L116+M116)/(D116+L116+M116+Q116)),0,(G116+L116+M116)/(D116+L116+M116+Q116))","v":0},{"$f":"Z116+X116","v":0},null,{"$f":"IF(ISERROR((S116+T116)/(U116+S116+T116)),0,(S116+T116)/(U116+S116+T116))","v":0}]
[{"$f":"'Neunkirchen Nightmares'!A63","v":713},{"$f":"IF('Neunkirchen Nightmares'!B63=\"\",\"\",'Neunkirchen Nightmares'!B63)","v":""},{"$f":"SUM('Neunkirchen Nightmares'!D63:D67)","v":0},{"$f":"SUM('Neunkirchen Nightmares'!E63:E67)","v":0},{"$f":"SUM('Neunkirchen Nightmares'!F63:F67)","v":0},{"$f":"SUM('Neunkirchen Nightmares'!G63:G67)","v":0},{"$f":"SUM('Neunkirchen Nightmares'!H63:H67)","v":0},{"$f":"SUM('Neunkirchen Nightmares'!I63:I67)","v":0},{"$f":"SUM('Neunkirchen Nightmares'!J63:J67)","v":0},{"$f":"SUM('Neunkirchen Nightmares'!K63:K67)","v":0},{"$f":"SUM('Neunkirchen Nightmares'!L63:L67)","v":0},{"$f":"SUM('Neunkirchen Nightmares'!M63:M67)","v":0},{"$f":"SUM('Neunkirchen Nightmares'!N63:N67)","v":0},{"$f":"SUM('Neunkirchen Nightmares'!O63:O67)","v":0},{"$f":"SUM('Neunkirchen Nightmares'!P63:P67)","v":0},{"$f":"SUM('Neunkirchen Nightmares'!Q63:Q67)","v":0},{"$f":"SUM('Neunkirchen Nightmares'!R63:R67)","v":0},null,{"$f":"SUM('Neunkirchen Nightmares'!T63:T67)","v":0},{"$f":"SUM('Neunkirchen Nightmares'!U63:U67)","v":0},{"$f":"SUM('Neunkirchen Nightmares'!V63:V67)","v":0},null,{"$f":"IF(ISERROR(G117/D117),0,G117/D117)","v":0},{"$f":"IF(ISERROR((4*J117+3*I117+2*H117+G117-SUM(H117:J117))/D117),0,(4*J117+3*I117+2*H117+G117-SUM(H117:J117))/D117)","v":0},{"$f":"W117+X117","v":0},{"$f":"IF(ISERROR((G117+L117+M117)/(D117+L117+M117+Q117)),0,(G117+L117+M117)/(D117+L117+M117+Q117))","v":0},{"$f":"Z117+X117","v":0},null,{"$f":"IF(ISERROR((S117+T117)/(U117+S117+T117)),0,(S117+T117)/(U117+S117+T117))","v":0}]
[{"$f":"'Neunkirchen Nightmares'!A68","v":714},{"$f":"IF('Neunkirchen Nightmares'!B68=\"\",\"\",'Neunkirchen Nightmares'!B68)","v":""},{"$f":"SUM('Neunkirchen Nightmares'!D68:D72)","v":0},{"$f":"SUM('Neunkirchen Nightmares'!E68:E72)","v":0},{"$f":"SUM('Neunkirchen Nightmares'!F68:F72)","v":0},{"$f":"SUM('Neunkirchen Nightmares'!G68:G72)","v":0},{"$f":"SUM('Neunkirchen Nightmares'!H68:H72)","v":0},{"$f":"SUM('Neunkirchen Nightmares'!I68:I72)","v":0},{"$f":"SUM('Neunkirchen Nightmares'!J68:J72)","v":0},{"$f":"SUM('Neunkirchen Nightmares'!K68:K72)","v":0},{"$f":"SUM('Neunkirchen Nightmares'!L68:L72)","v":0},{"$f":"SUM('Neunkirchen Nightmares'!M68:M72)","v":0},{"$f":"SUM('Neunkirchen Nightmares'!N68:N72)","v":0},{"$f":"SUM('Neunkirchen Nightmares'!O68:O72)","v":0},{"$f":"SUM('Neunkirchen Nightmares'!P68:P72)","v":0},{"$f":"SUM('Neunkirchen Nightmares'!Q68:Q72)","v":0},{"$f":"SUM('Neunkirchen Nightmares'!R68:R72)","v":0},null,{"$f":"SUM('Neunkirchen Nightmares'!T68:T72)","v":0},{"$f":"SUM('Neunkirchen Nightmares'!U68:U72)","v":0},{"$f":"SUM('Neunkirchen Nightmares'!V68:V72)","v":0},null,{"$f":"IF(ISERROR(G118/D118),0,G118/D118)","v":0},{"$f":"IF(ISERROR((4*J118+3*I118+2*H118+G118-SUM(H118:J118))/D118),0,(4*J118+3*I118+2*H118+G118-SUM(H118:J118))/D118)","v":0},{"$f":"W118+X118","v":0},{"$f":"IF(ISERROR((G118+L118+M118)/(D118+L118+M118+Q118)),0,(G118+L118+M118)/(D118+L118+M118+Q118))","v":0},{"$f":"Z118+X118","v":0},null,{"$f":"IF(ISERROR((S118+T118)/(U118+S118+T118)),0,(S118+T118)/(U118+S118+T118))","v":0}]
[{"$f":"'Neunkirchen Nightmares'!A73","v":715},{"$f":"IF('Neunkirchen Nightmares'!B73=\"\",\"\",'Neunkirchen Nightmares'!B73)","v":""},{"$f":"SUM('Neunkirchen Nightmares'!D73:D77)","v":0},{"$f":"SUM('Neunkirchen Nightmares'!E73:E77)","v":0},{"$f":"SUM('Neunkirchen Nightmares'!F73:F77)","v":0},{"$f":"SUM('Neunkirchen Nightmares'!G73:G77)","v":0},{"$f":"SUM('Neunkirchen Nightmares'!H73:H77)","v":0},{"$f":"SUM('Neunkirchen Nightmares'!I73:I77)","v":0},{"$f":"SUM('Neunkirchen Nightmares'!J73:J77)","v":0},{"$f":"SUM('Neunkirchen Nightmares'!K73:K77)","v":0},{"$f":"SUM('Neunkirchen Nightmares'!L73:L77)","v":0},{"$f":"SUM('Neunkirchen Nightmares'!M73:M77)","v":0},{"$f":"SUM('Neunkirchen Nightmares'!N73:N77)","v":0},{"$f":"SUM('Neunkirchen Nightmares'!O73:O77)","v":0},{"$f":"SUM('Neunkirchen Nightmares'!P73:P77)","v":0},{"$f":"SUM('Neunkirchen Nightmares'!Q73:Q77)","v":0},{"$f":"SUM('Neunkirchen Nightmares'!R73:R77)","v":0},null,{"$f":"SUM('Neunkirchen Nightmares'!T73:T77)","v":0},{"$f":"SUM('Neunkirchen Nightmares'!U73:U77)","v":0},{"$f":"SUM('Neunkirchen Nightmares'!V73:V77)","v":0},null,{"$f":"IF(ISERROR(G119/D119),0,G119/D119)","v":0},{"$f":"IF(ISERROR((4*J119+3*I119+2*H119+G119-SUM(H119:J119))/D119),0,(4*J119+3*I119+2*H119+G119-SUM(H119:J119))/D119)","v":0},{"$f":"W119+X119","v":0},{"$f":"IF(ISERROR((G119+L119+M119)/(D119+L119+M119+Q119)),0,(G119+L119+M119)/(D119+L119+M119+Q119))","v":0},{"$f":"Z119+X119","v":0},null,{"$f":"IF(ISERROR((S119+T119)/(U119+S119+T119)),0,(S119+T119)/(U119+S119+T119))","v":0}]
[{"$f":"'Neunkirchen Nightmares'!A78","v":716},{"$f":"IF('Neunkirchen Nightmares'!B78=\"\",\"\",'Neunkirchen Nightmares'!B78)","v":""},{"$f":"SUM('Neunkirchen Nightmares'!D78:D82)","v":0},{"$f":"SUM('Neunkirchen Nightmares'!E78:E82)","v":0},{"$f":"SUM('Neunkirchen Nightmares'!F78:F82)","v":0},{"$f":"SUM('Neunkirchen Nightmares'!G78:G82)","v":0},{"$f":"SUM('Neunkirchen Nightmares'!H78:H82)","v":0},{"$f":"SUM('Neunkirchen Nightmares'!I78:I82)","v":0},{"$f":"SUM('Neunkirchen Nightmares'!J78:J82)","v":0},{"$f":"SUM('Neunkirchen Nightmares'!K78:K82)","v":0},{"$f":"SUM('Neunkirchen Nightmares'!L78:L82)","v":0},{"$f":"SUM('Neunkirchen Nightmares'!M78:M82)","v":0},{"$f":"SUM('Neunkirchen Nightmares'!N78:N82)","v":0},{"$f":"SUM('Neunkirchen Nightmares'!O78:O82)","v":0},{"$f":"SUM('Neunkirchen Nightmares'!P78:P82)","v":0},{"$f":"SUM('Neunkirchen Nightmares'!Q78:Q82)","v":0},{"$f":"SUM('Neunkirchen Nightmares'!R78:R82)","v":0},null,{"$f":"SUM('Neunkirchen Nightmares'!T78:T82)","v":0},{"$f":"SUM('Neunkirchen Nightmares'!U78:U82)","v":0},{"$f":"SUM('Neunkirchen Nightmares'!V78:V82)","v":0},null,{"$f":"IF(ISERROR(G120/D120),0,G120/D120)","v":0},{"$f":"IF(ISERROR((4*J120+3*I120+2*H120+G120-SUM(H120:J120))/D120),0,(4*J120+3*I120+2*H120+G120-SUM(H120:J120))/D120)","v":0},{"$f":"W120+X120","v":0},{"$f":"IF(ISERROR((G120+L120+M120)/(D120+L120+M120+Q120)),0,(G120+L120+M120)/(D120+L120+M120+Q120))","v":0},{"$f":"Z120+X120","v":0},null,{"$f":"IF(ISERROR((S120+T120)/(U120+S120+T120)),0,(S120+T120)/(U120+S120+T120))","v":0}]
[{"$f":"'Neunkirchen Nightmares'!A83","v":717},{"$f":"IF('Neunkirchen Nightmares'!B83=\"\",\"\",'Neunkirchen Nightmares'!B83)","v":""},{"$f":"SUM('Neunkirchen Nightmares'!D83:D87)","v":0},{"$f":"SUM('Neunkirchen Nightmares'!E83:E87)","v":0},{"$f":"SUM('Neunkirchen Nightmares'!F83:F87)","v":0},{"$f":"SUM('Neunkirchen Nightmares'!G83:G87)","v":0},{"$f":"SUM('Neunkirchen Nightmares'!H83:H87)","v":0},{"$f":"SUM('Neunkirchen Nightmares'!I83:I87)","v":0},{"$f":"SUM('Neunkirchen Nightmares'!J83:J87)","v":0},{"$f":"SUM('Neunkirchen Nightmares'!K83:K87)","v":0},{"$f":"SUM('Neunkirchen Nightmares'!L83:L87)","v":0},{"$f":"SUM('Neunkirchen Nightmares'!M83:M87)","v":0},{"$f":"SUM('Neunkirchen Nightmares'!N83:N87)","v":0},{"$f":"SUM('Neunkirchen Nightmares'!O83:O87)","v":0},{"$f":"SUM('Neunkirchen Nightmares'!P83:P87)","v":0},{"$f":"SUM('Neunkirchen Nightmares'!Q83:Q87)","v":0},{"$f":"SUM('Neunkirchen Nightmares'!R83:R87)","v":0},null,{"$f":"SUM('Neunkirchen Nightmares'!T83:T87)","v":0},{"$f":"SUM('Neunkirchen Nightmares'!U83:U87)","v":0},{"$f":"SUM('Neunkirchen Nightmares'!V83:V87)","v":0},null,{"$f":"IF(ISERROR(G121/D121),0,G121/D121)","v":0},{"$f":"IF(ISERROR((4*J121+3*I121+2*H121+G121-SUM(H121:J121))/D121),0,(4*J121+3*I121+2*H121+G121-SUM(H121:J121))/D121)","v":0},{"$f":"W121+X121","v":0},{"$f":"IF(ISERROR((G121+L121+M121)/(D121+L121+M121+Q121)),0,(G121+L121+M121)/(D121+L121+M121+Q121))","v":0},{"$f":"Z121+X121","v":0},null,{"$f":"IF(ISERROR((S121+T121)/(U121+S121+T121)),0,(S121+T121)/(U121+S121+T121))","v":0}]
[{"$f":"'Team 8'!A3","v":801},{"$f":"IF('Team 8'!B3=\"\",\"\",'Team 8'!B3)","v":""},{"$f":"SUM('Team 8'!D3:D7)","v":0},{"$f":"SUM('Team 8'!E3:E7)","v":0},{"$f":"SUM('Team 8'!F3:F7)","v":0},{"$f":"SUM('Team 8'!G3:G7)","v":0},{"$f":"SUM('Team 8'!H3:H7)","v":0},{"$f":"SUM('Team 8'!I3:I7)","v":0},{"$f":"SUM('Team 8'!J3:J7)","v":0},{"$f":"SUM('Team 8'!K3:K7)","v":0},{"$f":"SUM('Team 8'!L3:L7)","v":0},{"$f":"SUM('Team 8'!M3:M7)","v":0},{"$f":"SUM('Team 8'!N3:N7)","v":0},{"$f":"SUM('Team 8'!O3:O7)","v":0},{"$f":"SUM('Team 8'!P3:P7)","v":0},{"$f":"SUM('Team 8'!Q3:Q7)","v":0},{"$f":"SUM('Team 8'!R3:R7)","v":0},null,{"$f":"SUM('Team 8'!T3:T7)","v":0},{"$f":"SUM('Team 8'!U3:U7)","v":0},{"$f":"SUM('Team 8'!V3:V7)","v":0},null,{"$f":"IF(ISERROR(G122/D122),0,G122/D122)","v":0},{"$f":"IF(ISERROR((4*J122+3*I122+2*H122+G122-SUM(H122:J122))/D122),0,(4*J122+3*I122+2*H122+G122-SUM(H122:J122))/D122)","v":0},{"$f":"W122+X122","v":0},{"$f":"IF(ISERROR((G122+L122+M122)/(D122+L122+M122+Q122)),0,(G122+L122+M122)/(D122+L122+M122+Q122))","v":0},{"$f":"Z122+X122","v":0},null,{"$f":"IF(ISERROR((S122+T122)/(U122+S122+T122)),0,(S122+T122)/(U122+S122+T122))","v":0}]
[{"$f":"'Team 8'!A8","v":802},{"$f":"IF('Team 8'!B8=\"\",\"\",'Team 8'!B8)","v":""},{"$f":"SUM('Team 8'!D8:D12)","v":0},{"$f":"SUM('Team 8'!E8:E12)","v":0},{"$f":"SUM('Team 8'!F8:F12)","v":0},{"$f":"SUM('Team 8'!G8:G12)","v":0},{"$f":"SUM('Team 8'!H8:H12)","v":0},{"$f":"SUM('Team 8'!I8:I12)","v":0},{"$f":"SUM('Team 8'!J8:J12)","v":0},{"$f":"SUM('Team 8'!K8:K12)","v":0},{"$f":"SUM('Team 8'!L8:L12)","v":0},{"$f":"SUM('Team 8'!M8:M12)","v":0},{"$f":"SUM('Team 8'!N8:N12)","v":0},{"$f":"SUM('Team 8'!O8:O12)","v":0},{"$f":"SUM('Team 8'!P8:P12)","v":0},{"$f":"SUM('Team 8'!Q8:Q12)","v":0},{"$f":"SUM('Team 8'!R8:R12)","v":0},null,{"$f":"SUM('Team 8'!T8:T12)","v":0},{"$f":"SUM('Team 8'!U8:U12)","v":0},{"$f":"SUM('Team 8'!V8:V12)","v":0},null,{"$f":"IF(ISERROR(G123/D123),0,G123/D123)","v":0},{"$f":"IF(ISERROR((4*J123+3*I123+2*H123+G123-SUM(H123:J123))/D123),0,(4*J123+3*I123+2*H123+G123-SUM(H123:J123))/D123)","v":0},{"$f":"W123+X123","v":0},{"$f":"IF(ISERROR((G123+L123+M123)/(D123+L123+M123+Q123)),0,(G123+L123+M123)/(D123+L123+M123+Q123))","v":0},{"$f":"Z123+X123","v":0},null,{"$f":"IF(ISERROR((S123+T123)/(U123+S123+T123)),0,(S123+T123)/(U123+S123+T123))","v":0}]
[{"$f":"'Team 8'!A13","v":803},{"$f":"IF('Team 8'!B13=\"\",\"\",'Team 8'!B13)","v":""},{"$f":"SUM('Team 8'!D13:D17)","v":0},{"$f":"SUM('Team 8'!E13:E17)","v":0},{"$f":"SUM('Team 8'!F13:F17)","v":0},{"$f":"SUM('Team 8'!G13:G17)","v":0},{"$f":"SUM('Team 8'!H13:H17)","v":0},{"$f":"SUM('Team 8'!I13:I17)","v":0},{"$f":"SUM('Team 8'!J13:J17)","v":0},{"$f":"SUM('Team 8'!K13:K17)","v":0},{"$f":"SUM('Team 8'!L13:L17)","v":0},{"$f":"SUM('Team 8'!M13:M17)","v":0},{"$f":"SUM('Team 8'!N13:N17)","v":0},{"$f":"SUM('Team 8'!O13:O17)","v":0},{"$f":"SUM('Team 8'!P13:P17)","v":0},{"$f":"SUM('Team 8'!Q13:Q17)","v":0},{"$f":"SUM('Team 8'!R13:R17)","v":0},null,{"$f":"SUM('Team 8'!T13:T17)","v":0},{"$f":"SUM('Team 8'!U13:U17)","v":0},{"$f":"SUM('Team 8'!V13:V17)","v":0},null,{"$f":"IF(ISERROR(G124/D124),0,G124/D124)","v":0},{"$f":"IF(ISERROR((4*J124+3*I124+2*H124+G124-SUM(H124:J124))/D124),0,(4*J124+3*I124+2*H124+G124-SUM(H124:J124))/D124)","v":0},{"$f":"W124+X124","v":0},{"$f":"IF(ISERROR((G124+L124+M124)/(D124+L124+M124+Q124)),0,(G124+L124+M124)/(D124+L124+M124+Q124))","v":0},{"$f":"Z124+X124","v":0},null,{"$f":"IF(ISERROR((S124+T124)/(U124+S124+T124)),0,(S124+T124)/(U124+S124+T124))","v":0}]
[{"$f":"'Team 8'!A18","v":804},{"$f":"IF('Team 8'!B18=\"\",\"\",'Team 8'!B18)","v":""},{"$f":"SUM('Team 8'!D18:D22)","v":0},{"$f":"SUM('Team 8'!E18:E22)","v":0},{"$f":"SUM('Team 8'!F18:F22)","v":0},{"$f":"SUM('Team 8'!G18:G22)","v":0},{"$f":"SUM('Team 8'!H18:H22)","v":0},{"$f":"SUM('Team 8'!I18:I22)","v":0},{"$f":"SUM('Team 8'!J18:J22)","v":0},{"$f":"SUM('Team 8'!K18:K22)","v":0},{"$f":"SUM('Team 8'!L18:L22)","v":0},{"$f":"SUM('Team 8'!M18:M22)","v":0},{"$f":"SUM('Team 8'!N18:N22)","v":0},{"$f":"SUM('Team 8'!O18:O22)","v":0},{"$f":"SUM('Team 8'!P18:P22)","v":0},{"$f":"SUM('Team 8'!Q18:Q22)","v":0},{"$f":"SUM('Team 8'!R18:R22)","v":0},null,{"$f":"SUM('Team 8'!T18:T22)","v":0},{"$f":"SUM('Team 8'!U18:U22)","v":0},{"$f":"SUM('Team 8'!V18:V22)","v":0},null,{"$f":"IF(ISERROR(G125/D125),0,G125/D125)","v":0},{"$f":"IF(ISERROR((4*J125+3*I125+2*H125+G125-SUM(H125:J125))/D125),0,(4*J125+3*I125+2*H125+G125-SUM(H125:J125))/D125)","v":0},{"$f":"W125+X125","v":0},{"$f":"IF(ISERROR((G125+L125+M125)/(D125+L125+M125+Q125)),0,(G125+L125+M125)/(D125+L125+M125+Q125))","v":0},{"$f":"Z125+X125","v":0},null,{"$f":"IF(ISERROR((S125+T125)/(U125+S125+T125)),0,(S125+T125)/(U125+S125+T125))","v":0}]
[{"$f":"'Team 8'!A23","v":805},{"$f":"IF('Team 8'!B23=\"\",\"\",'Team 8'!B23)","v":""},{"$f":"SUM('Team 8'!D23:D27)","v":0},{"$f":"SUM('Team 8'!E23:E27)","v":0},{"$f":"SUM('Team 8'!F23:F27)","v":0},{"$f":"SUM('Team 8'!G23:G27)","v":0},{"$f":"SUM('Team 8'!H23:H27)","v":0},{"$f":"SUM('Team 8'!I23:I27)","v":0},{"$f":"SUM('Team 8'!J23:J27)","v":0},{"$f":"SUM('Team 8'!K23:K27)","v":0},{"$f":"SUM('Team 8'!L23:L27)","v":0},{"$f":"SUM('Team 8'!M23:M27)","v":0},{"$f":"SUM('Team 8'!N23:N27)","v":0},{"$f":"SUM('Team 8'!O23:O27)","v":0},{"$f":"SUM('Team 8'!P23:P27)","v":0},{"$f":"SUM('Team 8'!Q23:Q27)","v":0},{"$f":"SUM('Team 8'!R23:R27)","v":0},null,{"$f":"SUM('Team 8'!T23:T27)","v":0},{"$f":"SUM('Team 8'!U23:U27)","v":0},{"$f":"SUM('Team 8'!V23:V27)","v":0},null,{"$f":"IF(ISERROR(G126/D126),0,G126/D126)","v":0},{"$f":"IF(ISERROR((4*J126+3*I126+2*H126+G126-SUM(H126:J126))/D126),0,(4*J126+3*I126+2*H126+G126-SUM(H126:J126))/D126)","v":0},{"$f":"W126+X126","v":0},{"$f":"IF(ISERROR((G126+L126+M126)/(D126+L126+M126+Q126)),0,(G126+L126+M126)/(D126+L126+M126+Q126))","v":0},{"$f":"Z126+X126","v":0},null,{"$f":"IF(ISERROR((S126+T126)/(U126+S126+T126)),0,(S126+T126)/(U126+S126+T126))","v":0}]
[{"$f":"'Team 8'!A28","v":806},{"$f":"IF('Team 8'!B28=\"\",\"\",'Team 8'!B28)","v":""},{"$f":"SUM('Team 8'!D28:D32)","v":0},{"$f":"SUM('Team 8'!E28:E32)","v":0},{"$f":"SUM('Team 8'!F28:F32)","v":0},{"$f":"SUM('Team 8'!G28:G32)","v":0},{"$f":"SUM('Team 8'!H28:H32)","v":0},{"$f":"SUM('Team 8'!I28:I32)","v":0},{"$f":"SUM('Team 8'!J28:J32)","v":0},{"$f":"SUM('Team 8'!K28:K32)","v":0},{"$f":"SUM('Team 8'!L28:L32)","v":0},{"$f":"SUM('Team 8'!M28:M32)","v":0},{"$f":"SUM('Team 8'!N28:N32)","v":0},{"$f":"SUM('Team 8'!O28:O32)","v":0},{"$f":"SUM('Team 8'!P28:P32)","v":0},{"$f":"SUM('Team 8'!Q28:Q32)","v":0},{"$f":"SUM('Team 8'!R28:R32)","v":0},null,{"$f":"SUM('Team 8'!T28:T32)","v":0},{"$f":"SUM('Team 8'!U28:U32)","v":0},{"$f":"SUM('Team 8'!V28:V32)","v":0},null,{"$f":"IF(ISERROR(G127/D127),0,G127/D127)","v":0},{"$f":"IF(ISERROR((4*J127+3*I127+2*H127+G127-SUM(H127:J127))/D127),0,(4*J127+3*I127+2*H127+G127-SUM(H127:J127))/D127)","v":0},{"$f":"W127+X127","v":0},{"$f":"IF(ISERROR((G127+L127+M127)/(D127+L127+M127+Q127)),0,(G127+L127+M127)/(D127+L127+M127+Q127))","v":0},{"$f":"Z127+X127","v":0},null,{"$f":"IF(ISERROR((S127+T127)/(U127+S127+T127)),0,(S127+T127)/(U127+S127+T127))","v":0}]
[{"$f":"'Team 8'!A33","v":807},{"$f":"IF('Team 8'!B33=\"\",\"\",'Team 8'!B33)","v":""},{"$f":"SUM('Team 8'!D33:D37)","v":0},{"$f":"SUM('Team 8'!E33:E37)","v":0},{"$f":"SUM('Team 8'!F33:F37)","v":0},{"$f":"SUM('Team 8'!G33:G37)","v":0},{"$f":"SUM('Team 8'!H33:H37)","v":0},{"$f":"SUM('Team 8'!I33:I37)","v":0},{"$f":"SUM('Team 8'!J33:J37)","v":0},{"$f":"SUM('Team 8'!K33:K37)","v":0},{"$f":"SUM('Team 8'!L33:L37)","v":0},{"$f":"SUM('Team 8'!M33:M37)","v":0},{"$f":"SUM('Team 8'!N33:N37)","v":0},{"$f":"SUM('Team 8'!O33:O37)","v":0},{"$f":"SUM('Team 8'!P33:P37)","v":0},{"$f":"SUM('Team 8'!Q33:Q37)","v":0},{"$f":"SUM('Team 8'!R33:R37)","v":0},null,{"$f":"SUM('Team 8'!T33:T37)","v":0},{"$f":"SUM('Team 8'!U33:U37)","v":0},{"$f":"SUM('Team 8'!V33:V37)","v":0},null,{"$f":"IF(ISERROR(G128/D128),0,G128/D128)","v":0},{"$f":"IF(ISERROR((4*J128+3*I128+2*H128+G128-SUM(H128:J128))/D128),0,(4*J128+3*I128+2*H128+G128-SUM(H128:J128))/D128)","v":0},{"$f":"W128+X128","v":0},{"$f":"IF(ISERROR((G128+L128+M128)/(D128+L128+M128+Q128)),0,(G128+L128+M128)/(D128+L128+M128+Q128))","v":0},{"$f":"Z128+X128","v":0},null,{"$f":"IF(ISERROR((S128+T128)/(U128+S128+T128)),0,(S128+T128)/(U128+S128+T128))","v":0}]
[{"$f":"'Team 8'!A38","v":808},{"$f":"IF('Team 8'!B38=\"\",\"\",'Team 8'!B38)","v":""},{"$f":"SUM('Team 8'!D38:D42)","v":0},{"$f":"SUM('Team 8'!E38:E42)","v":0},{"$f":"SUM('Team 8'!F38:F42)","v":0},{"$f":"SUM('Team 8'!G38:G42)","v":0},{"$f":"SUM('Team 8'!H38:H42)","v":0},{"$f":"SUM('Team 8'!I38:I42)","v":0},{"$f":"SUM('Team 8'!J38:J42)","v":0},{"$f":"SUM('Team 8'!K38:K42)","v":0},{"$f":"SUM('Team 8'!L38:L42)","v":0},{"$f":"SUM('Team 8'!M38:M42)","v":0},{"$f":"SUM('Team 8'!N38:N42)","v":0},{"$f":"SUM('Team 8'!O38:O42)","v":0},{"$f":"SUM('Team 8'!P38:P42)","v":0},{"$f":"SUM('Team 8'!Q38:Q42)","v":0},{"$f":"SUM('Team 8'!R38:R42)","v":0},null,{"$f":"SUM('Team 8'!T38:T42)","v":0},{"$f":"SUM('Team 8'!U38:U42)","v":0},{"$f":"SUM('Team 8'!V38:V42)","v":0},null,{"$f":"IF(ISERROR(G129/D129),0,G129/D129)","v":0},{"$f":"IF(ISERROR((4*J129+3*I129+2*H129+G129-SUM(H129:J129))/D129),0,(4*J129+3*I129+2*H129+G129-SUM(H129:J129))/D129)","v":0},{"$f":"W129+X129","v":0},{"$f":"IF(ISERROR((G129+L129+M129)/(D129+L129+M129+Q129)),0,(G129+L129+M129)/(D129+L129+M129+Q129))","v":0},{"$f":"Z129+X129","v":0},null,{"$f":"IF(ISERROR((S129+T129)/(U129+S129+T129)),0,(S129+T129)/(U129+S129+T129))","v":0}]
[{"$f":"'Team 8'!A43","v":809},{"$f":"IF('Team 8'!B43=\"\",\"\",'Team 8'!B43)","v":""},{"$f":"SUM('Team 8'!D43:D47)","v":0},{"$f":"SUM('Team 8'!E43:E47)","v":0},{"$f":"SUM('Team 8'!F43:F47)","v":0},{"$f":"SUM('Team 8'!G43:G47)","v":0},{"$f":"SUM('Team 8'!H43:H47)","v":0},{"$f":"SUM('Team 8'!I43:I47)","v":0},{"$f":"SUM('Team 8'!J43:J47)","v":0},{"$f":"SUM('Team 8'!K43:K47)","v":0},{"$f":"SUM('Team 8'!L43:L47)","v":0},{"$f":"SUM('Team 8'!M43:M47)","v":0},{"$f":"SUM('Team 8'!N43:N47)","v":0},{"$f":"SUM('Team 8'!O43:O47)","v":0},{"$f":"SUM('Team 8'!P43:P47)","v":0},{"$f":"SUM('Team 8'!Q43:Q47)","v":0},{"$f":"SUM('Team 8'!R43:R47)","v":0},null,{"$f":"SUM('Team 8'!T43:T47)","v":0},{"$f":"SUM('Team 8'!U43:U47)","v":0},{"$f":"SUM('Team 8'!V43:V47)","v":0},null,{"$f":"IF(ISERROR(G130/D130),0,G130/D130)","v":0},{"$f":"IF(ISERROR((4*J130+3*I130+2*H130+G130-SUM(H130:J130))/D130),0,(4*J130+3*I130+2*H130+G130-SUM(H130:J130))/D130)","v":0},{"$f":"W130+X130","v":0},{"$f":"IF(ISERROR((G130+L130+M130)/(D130+L130+M130+Q130)),0,(G130+L130+M130)/(D130+L130+M130+Q130))","v":0},{"$f":"Z130+X130","v":0},null,{"$f":"IF(ISERROR((S130+T130)/(U130+S130+T130)),0,(S130+T130)/(U130+S130+T130))","v":0}]
[{"$f":"'Team 8'!A48","v":810},{"$f":"IF('Team 8'!B48=\"\",\"\",'Team 8'!B48)","v":""},{"$f":"SUM('Team 8'!D48:D52)","v":0},{"$f":"SUM('Team 8'!E48:E52)","v":0},{"$f":"SUM('Team 8'!F48:F52)","v":0},{"$f":"SUM('Team 8'!G48:G52)","v":0},{"$f":"SUM('Team 8'!H48:H52)","v":0},{"$f":"SUM('Team 8'!I48:I52)","v":0},{"$f":"SUM('Team 8'!J48:J52)","v":0},{"$f":"SUM('Team 8'!K48:K52)","v":0},{"$f":"SUM('Team 8'!L48:L52)","v":0},{"$f":"SUM('Team 8'!M48:M52)","v":0},{"$f":"SUM('Team 8'!N48:N52)","v":0},{"$f":"SUM('Team 8'!O48:O52)","v":0},{"$f":"SUM('Team 8'!P48:P52)","v":0},{"$f":"SUM('Team 8'!Q48:Q52)","v":0},{"$f":"SUM('Team 8'!R48:R52)","v":0},null,{"$f":"SUM('Team 8'!T48:T52)","v":0},{"$f":"SUM('Team 8'!U48:U52)","v":0},{"$f":"SUM('Team 8'!V48:V52)","v":0},null,{"$f":"IF(ISERROR(G131/D131),0,G131/D131)","v":0},{"$f":"IF(ISERROR((4*J131+3*I131+2*H131+G131-SUM(H131:J131))/D131),0,(4*J131+3*I131+2*H131+G131-SUM(H131:J131))/D131)","v":0},{"$f":"W131+X131","v":0},{"$f":"IF(ISERROR((G131+L131+M131)/(D131+L131+M131+Q131)),0,(G131+L131+M131)/(D131+L131+M131+Q131))","v":0},{"$f":"Z131+X131","v":0},null,{"$f":"IF(ISERROR((S131+T131)/(U131+S131+T131)),0,(S131+T131)/(U131+S131+T131))","v":0}]
[{"$f":"'Team 8'!A53","v":811},{"$f":"IF('Team 8'!B53=\"\",\"\",'Team 8'!B53)","v":""},{"$f":"SUM('Team 8'!D53:D57)","v":0},{"$f":"SUM('Team 8'!E53:E57)","v":0},{"$f":"SUM('Team 8'!F53:F57)","v":0},{"$f":"SUM('Team 8'!G53:G57)","v":0},{"$f":"SUM('Team 8'!H53:H57)","v":0},{"$f":"SUM('Team 8'!I53:I57)","v":0},{"$f":"SUM('Team 8'!J53:J57)","v":0},{"$f":"SUM('Team 8'!K53:K57)","v":0},{"$f":"SUM('Team 8'!L53:L57)","v":0},{"$f":"SUM('Team 8'!M53:M57)","v":0},{"$f":"SUM('Team 8'!N53:N57)","v":0},{"$f":"SUM('Team 8'!O53:O57)","v":0},{"$f":"SUM('Team 8'!P53:P57)","v":0},{"$f":"SUM('Team 8'!Q53:Q57)","v":0},{"$f":"SUM('Team 8'!R53:R57)","v":0},null,{"$f":"SUM('Team 8'!T53:T57)","v":0},{"$f":"SUM('Team 8'!U53:U57)","v":0},{"$f":"SUM('Team 8'!V53:V57)","v":0},null,{"$f":"IF(ISERROR(G132/D132),0,G132/D132)","v":0},{"$f":"IF(ISERROR((4*J132+3*I132+2*H132+G132-SUM(H132:J132))/D132),0,(4*J132+3*I132+2*H132+G132-SUM(H132:J132))/D132)","v":0},{"$f":"W132+X132","v":0},{"$f":"IF(ISERROR((G132+L132+M132)/(D132+L132+M132+Q132)),0,(G132+L132+M132)/(D132+L132+M132+Q132))","v":0},{"$f":"Z132+X132","v":0},null,{"$f":"IF(ISERROR((S132+T132)/(U132+S132+T132)),0,(S132+T132)/(U132+S132+T132))","v":0}]
[{"$f":"'Team 8'!A58","v":812},{"$f":"IF('Team 8'!B58=\"\",\"\",'Team 8'!B58)","v":""},{"$f":"SUM('Team 8'!D58:D62)","v":0},{"$f":"SUM('Team 8'!E58:E62)","v":0},{"$f":"SUM('Team 8'!F58:F62)","v":0},{"$f":"SUM('Team 8'!G58:G62)","v":0},{"$f":"SUM('Team 8'!H58:H62)","v":0},{"$f":"SUM('Team 8'!I58:I62)","v":0},{"$f":"SUM('Team 8'!J58:J62)","v":0},{"$f":"SUM('Team 8'!K58:K62)","v":0},{"$f":"SUM('Team 8'!L58:L62)","v":0},{"$f":"SUM('Team 8'!M58:M62)","v":0},{"$f":"SUM('Team 8'!N58:N62)","v":0},{"$f":"SUM('Team 8'!O58:O62)","v":0},{"$f":"SUM('Team 8'!P58:P62)","v":0},{"$f":"SUM('Team 8'!Q58:Q62)","v":0},{"$f":"SUM('Team 8'!R58:R62)","v":0},null,{"$f":"SUM('Team 8'!T58:T62)","v":0},{"$f":"SUM('Team 8'!U58:U62)","v":0},{"$f":"SUM('Team 8'!V58:V62)","v":0},null,{"$f":"IF(ISERROR(G133/D133),0,G133/D133)","v":0},{"$f":"IF(ISERROR((4*J133+3*I133+2*H133+G133-SUM(H133:J133))/D133),0,(4*J133+3*I133+2*H133+G133-SUM(H133:J133))/D133)","v":0},{"$f":"W133+X133","v":0},{"$f":"IF(ISERROR((G133+L133+M133)/(D133+L133+M133+Q133)),0,(G133+L133+M133)/(D133+L133+M133+Q133))","v":0},{"$f":"Z133+X133","v":0},null,{"$f":"IF(ISERROR((S133+T133)/(U133+S133+T133)),0,(S133+T133)/(U133+S133+T133))","v":0}]
[{"$f":"'Team 8'!A63","v":813},{"$f":"IF('Team 8'!B63=\"\",\"\",'Team 8'!B63)","v":""},{"$f":"SUM('Team 8'!D63:D67)","v":0},{"$f":"SUM('Team 8'!E63:E67)","v":0},{"$f":"SUM('Team 8'!F63:F67)","v":0},{"$f":"SUM('Team 8'!G63:G67)","v":0},{"$f":"SUM('Team 8'!H63:H67)","v":0},{"$f":"SUM('Team 8'!I63:I67)","v":0},{"$f":"SUM('Team 8'!J63:J67)","v":0},{"$f":"SUM('Team 8'!K63:K67)","v":0},{"$f":"SUM('Team 8'!L63:L67)","v":0},{"$f":"SUM('Team 8'!M63:M67)","v":0},{"$f":"SUM('Team 8'!N63:N67)","v":0},{"$f":"SUM('Team 8'!O63:O67)","v":0},{"$f":"SUM('Team 8'!P63:P67)","v":0},{"$f":"SUM('Team 8'!Q63:Q67)","v":0},{"$f":"SUM('Team 8'!R63:R67)","v":0},null,{"$f":"SUM('Team 8'!T63:T67)","v":0},{"$f":"SUM('Team 8'!U63:U67)","v":0},{"$f":"SUM('Team 8'!V63:V67)","v":0},null,{"$f":"IF(ISERROR(G134/D134),0,G134/D134)","v":0},{"$f":"IF(ISERROR((4*J134+3*I134+2*H134+G134-SUM(H134:J134))/D134),0,(4*J134+3*I134+2*H134+G134-SUM(H134:J134))/D134)","v":0},{"$f":"W134+X134","v":0},{"$f":"IF(ISERROR((G134+L134+M134)/(D134+L134+M134+Q134)),0,(G134+L134+M134)/(D134+L134+M134+Q134))","v":0},{"$f":"Z134+X134","v":0},null,{"$f":"IF(ISERROR((S134+T134)/(U134+S134+T134)),0,(S134+T134)/(U134+S134+T134))","v":0}]
[{"$f":"'Team 8'!A68","v":814},{"$f":"IF('Team 8'!B68=\"\",\"\",'Team 8'!B68)","v":""},{"$f":"SUM('Team 8'!D68:D72)","v":0},{"$f":"SUM('Team 8'!E68:E72)","v":0},{"$f":"SUM('Team 8'!F68:F72)","v":0},{"$f":"SUM('Team 8'!G68:G72)","v":0},{"$f":"SUM('Team 8'!H68:H72)","v":0},{"$f":"SUM('Team 8'!I68:I72)","v":0},{"$f":"SUM('Team 8'!J68:J72)","v":0},{"$f":"SUM('Team 8'!K68:K72)","v":0},{"$f":"SUM('Team 8'!L68:L72)","v":0},{"$f":"SUM('Team 8'!M68:M72)","v":0},{"$f":"SUM('Team 8'!N68:N72)","v":0},{"$f":"SUM('Team 8'!O68:O72)","v":0},{"$f":"SUM('Team 8'!P68:P72)","v":0},{"$f":"SUM('Team 8'!Q68:Q72)","v":0},{"$f":"SUM('Team 8'!R68:R72)","v":0},null,{"$f":"SUM('Team 8'!T68:T72)","v":0},{"$f":"SUM('Team 8'!U68:U72)","v":0},{"$f":"SUM('Team 8'!V68:V72)","v":0},null,{"$f":"IF(ISERROR(G135/D135),0,G135/D135)","v":0},{"$f":"IF(ISERROR((4*J135+3*I135+2*H135+G135-SUM(H135:J135))/D135),0,(4*J135+3*I135+2*H135+G135-SUM(H135:J135))/D135)","v":0},{"$f":"W135+X135","v":0},{"$f":"IF(ISERROR((G135+L135+M135)/(D135+L135+M135+Q135)),0,(G135+L135+M135)/(D135+L135+M135+Q135))","v":0},{"$f":"Z135+X135","v":0},null,{"$f":"IF(ISERROR((S135+T135)/(U135+S135+T135)),0,(S135+T135)/(U135+S135+T135))","v":0}]
[{"$f":"'Team 8'!A73","v":815},{"$f":"IF('Team 8'!B73=\"\",\"\",'Team 8'!B73)","v":""},{"$f":"SUM('Team 8'!D73:D77)","v":0},{"$f":"SUM('Team 8'!E73:E77)","v":0},{"$f":"SUM('Team 8'!F73:F77)","v":0},{"$f":"SUM('Team 8'!G73:G77)","v":0},{"$f":"SUM('Team 8'!H73:H77)","v":0},{"$f":"SUM('Team 8'!I73:I77)","v":0},{"$f":"SUM('Team 8'!J73:J77)","v":0},{"$f":"SUM('Team 8'!K73:K77)","v":0},{"$f":"SUM('Team 8'!L73:L77)","v":0},{"$f":"SUM('Team 8'!M73:M77)","v":0},{"$f":"SUM('Team 8'!N73:N77)","v":0},{"$f":"SUM('Team 8'!O73:O77)","v":0},{"$f":"SUM('Team 8'!P73:P77)","v":0},{"$f":"SUM('Team 8'!Q73:Q77)","v":0},{"$f":"SUM('Team 8'!R73:R77)","v":0},null,{"$f":"SUM('Team 8'!T73:T77)","v":0},{"$f":"SUM('Team 8'!U73:U77)","v":0},{"$f":"SUM('Team 8'!V73:V77)","v":0},null,{"$f":"IF(ISERROR(G136/D136),0,G136/D136)","v":0},{"$f":"IF(ISERROR((4*J136+3*I136+2*H136+G136-SUM(H136:J136))/D136),0,(4*J136+3*I136+2*H136+G136-SUM(H136:J136))/D136)","v":0},{"$f":"W136+X136","v":0},{"$f":"IF(ISERROR((G136+L136+M136)/(D136+L136+M136+Q136)),0,(G136+L136+M136)/(D136+L136+M136+Q136))","v":0},{"$f":"Z136+X136","v":0},null,{"$f":"IF(ISERROR((S136+T136)/(U136+S136+T136)),0,(S136+T136)/(U136+S136+T136))","v":0}]
[{"$f":"'Team 8'!A78","v":816},{"$f":"IF('Team 8'!B78=\"\",\"\",'Team 8'!B78)","v":""},{"$f":"SUM('Team 8'!D78:D82)","v":0},{"$f":"SUM('Team 8'!E78:E82)","v":0},{"$f":"SUM('Team 8'!F78:F82)","v":0},{"$f":"SUM('Team 8'!G78:G82)","v":0},{"$f":"SUM('Team 8'!H78:H82)","v":0},{"$f":"SUM('Team 8'!I78:I82)","v":0},{"$f":"SUM('Team 8'!J78:J82)","v":0},{"$f":"SUM('Team 8'!K78:K82)","v":0},{"$f":"SUM('Team 8'!L78:L82)","v":0},{"$f":"SUM('Team 8'!M78:M82)","v":0},{"$f":"SUM('Team 8'!N78:N82)","v":0},{"$f":"SUM('Team 8'!O78:O82)","v":0},{"$f":"SUM('Team 8'!P78:P82)","v":0},{"$f":"SUM('Team 8'!Q78:Q82)","v":0},{"$f":"SUM('Team 8'!R78:R82)","v":0},null,{"$f":"SUM('Team 8'!T78:T82)","v":0},{"$f":"SUM('Team 8'!U78:U82)","v":0},{"$f":"SUM('Team 8'!V78:V82)","v":0},null,{"$f":"IF(ISERROR(G137/D137),0,G137/D137)","v":0},{"$f":"IF(ISERROR((4*J137+3*I137+2*H137+G137-SUM(H137:J137))/D137),0,(4*J137+3*I137+2*H137+G137-SUM(H137:J137))/D137)","v":0},{"$f":"W137+X137","v":0},{"$f":"IF(ISERROR((G137+L137+M137)/(D137+L137+M137+Q137)),0,(G137+L137+M137)/(D137+L137+M137+Q137))","v":0},{"$f":"Z137+X137","v":0},null,{"$f":"IF(ISERROR((S137+T137)/(U137+S137+T137)),0,(S137+T137)/(U137+S137+T137))","v":0}]
[{"$f":"'Team 8'!A83","v":817},{"$f":"IF('Team 8'!B83=\"\",\"\",'Team 8'!B83)","v":""},{"$f":"SUM('Team 8'!D83:D87)","v":0},{"$f":"SUM('Team 8'!E83:E87)","v":0},{"$f":"SUM('Team 8'!F83:F87)","v":0},{"$f":"SUM('Team 8'!G83:G87)","v":0},{"$f":"SUM('Team 8'!H83:H87)","v":0},{"$f":"SUM('Team 8'!I83:I87)","v":0},{"$f":"SUM('Team 8'!J83:J87)","v":0},{"$f":"SUM('Team 8'!K83:K87)","v":0},{"$f":"SUM('Team 8'!L83:L87)","v":0},{"$f":"SUM('Team 8'!M83:M87)","v":0},{"$f":"SUM('Team 8'!N83:N87)","v":0},{"$f":"SUM('Team 8'!O83:O87)","v":0},{"$f":"SUM('Team 8'!P83:P87)","v":0},{"$f":"SUM('Team 8'!Q83:Q87)","v":0},{"$f":"SUM('Team 8'!R83:R87)","v":0},null,{"$f":"SUM('Team 8'!T83:T87)","v":0},{"$f":"SUM('Team 8'!U83:U87)","v":0},{"$f":"SUM('Team 8'!V83:V87)","v":0},null,{"$f":"IF(ISERROR(G138/D138),0,G138/D138)","v":0},{"$f":"IF(ISERROR((4*J138+3*I138+2*H138+G138-SUM(H138:J138))/D138),0,(4*J138+3*I138+2*H138+G138-SUM(H138:J138))/D138)","v":0},{"$f":"W138+X138","v":0},{"$f":"IF(ISERROR((G138+L138+M138)/(D138+L138+M138+Q138)),0,(G138+L138+M138)/(D138+L138+M138+Q138))","v":0},{"$f":"Z138+X138","v":0},null,{"$f":"IF(ISERROR((S138+T138)/(U138+S138+T138)),0,(S138+T138)/(U138+S138+T138))","v":0}]

{"sheet":"Pitching","index":9,"n_rows":97,"n_cols":22,"rows_kept":97,"cut":false,"hidden":false,"merged":[]}
["ID","Spieler","Gegner","IP","BF","AB","R","ER","H","2B","3B","HR","K","BB","HP","SH","SF","WP","BK","W","L","S"]
[1,"Bertonasco","Wesseling",2,20,10,12,1,1,null,null,null,1,10,null,null,null,2,null,null,1]
[]
[]
[]
[]
[10,"Hermann","Wesseling",1,8,2,3,3,null,null,null,null,null,5,1]
[]
[]
[]
[]
[24,"Dickmeiss","Hamburg",3,9,9,null,null,null,null,null,null,6,null,null,null,null,null,null,1]
[null,null,"Haar",5,20,20,2,2,3,2,null,null,6,null,null,null,null,null,null,1]
[null,null,"Freising",5,31,27,10,6,10,2,1,null,8,4,null,null,null,1,null,null,1]
[null,null,"Haar",7,36,33,7,6,12,1,null,2,11,3,null,null,null,1,null,null,1]
[]
[32,"Biswas, T.","Karlsruhe",5,27,23,7,2,7,1,null,null,5,3,1,null,null,null,null,1]
[]
[]
[]
[]
[59,"Reibenspies","Freising",0,7,4,7,6,3,1,null,null,null,3,null,null,null,2,null,null,1]
[null,null,"Neunkirchen","3,33",14,12,2,2,2,null,1,null,5,2,null,null,null,null,null,1]
[null,null,"Haar",4,20,18,3,3,7,null,1,null,null,1,null,1,null,1]
[]
[]
[57,"Weil","Freising",0.33,5,3,4,3,2,null,null,null,null,2,null,null,null,1]
[null,null,"Neunkirchen",0.66,6,1,3,2,1,null,null,null,null,4,null,null,1,1]
[null,null,"Haar",2,12,8,3,2,null,null,null,null,2,4,null,null,null,3]
[]
[]
[65,"Rauprich","Freising",3.66,22,13,5,4,4,1,null,null,null,7,null,null,2,3]
[null,null,"Haar","0",3,2,3,2,2,1,null,null,null,1,null,null,null,null,null,null,1]
[]
[]
[]
[70,"Parpart","Karlsruhe","3,33",32,24,15,10,11,3,null,null,3,8,null,null,null,1,null,null,1]
[null,null,"Hamburg",1,11,10,3,1,4,null,null,null,null,1,null,null,null,null,null,1]
[]
[]
[]
[50,"Reinisch, Sophie","Hamburg",4,18,16,4,4,4,1,1,null,2,2,null,null,null,2,null,1]
[null,null,"Karlsruhe",1.33,9,8,2,2,4,null,null,null,1,1]
[null,null,"Wesseling",7,25,24,2,2,2,1,null,null,7,1,null,null,null,null,null,1]
[null,null,"freising",5.33,28,19,9,4,7,3,null,null,null,4,null,4,1,1,null,null,1]
[]
[13,"Heiland","Haar",0.33,10,4,9,8,4,null,1,null,null,6,null,null,null,3,null,null,1]
[]
[]
[]
[]
[19,"Ottenberg","Haar",3,25,17,12,8,4,null,1,null,2,7,1,null,null,2]
[]
[]
[]
[]
[11,"Fluegge","Haar",0.66,1,1,null,null,null,null,null,null,null,null,null,null,null,1]
[]
[]
[]
[]
[51,"Raziorrouh","Wesseling",5,35,21,13,9,8,3,null,null,1,9,null,5,null,null,null,null,1]
[null,null,"Karlsruhe",3.66,18,11,4,4,3,2,null,null,null,5,1,null,1,1,null,1]
[]
[]
[]
[38,"Biswas, L.","Neunkirchen",2,13,4,2,2,null,null,null,null,1,9,null,null,null,7,null,1]
[]
[]
[]
[]
[41,"Thürmer","Neunkirchen",2,10,8,2,2,2,1,null,null,1,2]
[]
[]
[]
[]
[72,"Singer","Freising",4,35,28,19,13,12,3,3,null,3,5,2,null,null,3,null,null,1]
[null,null,"Hamburg",3,21,15,8,2,3,1,null,null,5,4,2]
[]
[]
[]
[35,"Sandner","Wesseling",5,16,16,null,null,1,null,null,null,7,null,null,null,null,null,null,1]
[null,null,"Haar",6,29,22,2,1,4,null,null,null,5,5,2,null,null,null,null,1]
[]
[]
[]
[43,"Stepniak","Karlsruhe",2,11,7,1,1,1,null,null,null,4,2,2,null,null,5,null,null,null,1]
[null,null,"Freising",0.33,2,2,null,null,null,null,null,null,1,1,null,null,null,2]
[]
[]
[]
[null,"Rackwitz","Neunkirchen",2,12,6,4,4,1,null,null,null,1,5,null,null,1,2]
[]
[]
[]
[]
[null,"Ernst","Neunkirchen",2,18,9,10,4,3,null,null,null,null,8,null,1,null,null,null,null,1]

{"sheet":"Pitching Leaders","index":10,"n_rows":52,"n_cols":26,"rows_kept":52,"cut":false,"hidden":false,"merged":[[0,2,0,20],[0,22,0,25]]}
[null,null,"Pitching",null,null,null,null,null,null,null,null,null,null,null,null,null,null,null,null,null,null,null,"Pitching Percentage"]
["ID","Spieler","IP","BF","AB","R","ER","H","2B","3B","HR","K","BB","HP","SH","SF","WP","BK","W","L","S",null,"ERA","K/IP","WHIP","OAVG"]
[{"$f":"Pitching!A82","v":35},{"$f":"IF(Pitching!B82=\"\",\"\",Pitching!B82)","v":"Sandner"},{"$f":"SUM(Pitching!D82:D86)","v":11},{"$f":"SUM(Pitching!E82:E86)","v":45},{"$f":"SUM(Pitching!F82:F86)","v":38},{"$f":"SUM(Pitching!G82:G86)","v":2},{"$f":"SUM(Pitching!H82:H86)","v":1},{"$f":"SUM(Pitching!I82:I86)","v":5},{"$f":"SUM(Pitching!J82:J86)","v":0},{"$f":"SUM(Pitching!K82:K86)","v":0},{"$f":"SUM(Pitching!L82:L86)","v":0},{"$f":"SUM(Pitching!M82:M86)","v":12},{"$f":"SUM(Pitching!N82:N86)","v":5},{"$f":"SUM(Pitching!O82:O86)","v":2},{"$f":"SUM(Pitching!P82:P86)","v":0},{"$f":"SUM(Pitching!Q82:Q86)","v":0},{"$f":"SUM(Pitching!R82:R86)","v":0},{"$f":"SUM(Pitching!S82:S86)","v":0},{"$f":"COUNTA(Pitching!T82:T86)","v":2},{"$f":"COUNTA(Pitching!U82:U86)","v":0},{"$f":"COUNTA(Pitching!V82:V86)","v":0},null,{"$f":"IF(ISERROR(7*G3/C3),\"-\",7*G3/C3)","v":0.63636363636363635},{"$f":"IF(ISERROR(L3/C3),0,L3/C3)","v":1.0909090909090908},{"$f":"IF(ISERROR((M3+H3)/C3),\"-\",(M3+H3)/C3)","v":0.90909090909090906},{"$f":"IF(ISERROR(H3/E3),\"-\",(H3/E3))","v":0.13157894736842105}]
[{"$f":"Pitching!A57","v":11},{"$f":"IF(Pitching!B57=\"\",\"\",Pitching!B57)","v":"Fluegge"},{"$f":"SUM(Pitching!D57:D61)","v":0.66},{"$f":"SUM(Pitching!E57:E61)","v":1},{"$f":"SUM(Pitching!F57:F61)","v":1},{"$f":"SUM(Pitching!G57:G61)","v":0},{"$f":"SUM(Pitching!H57:H61)","v":0},{"$f":"SUM(Pitching!I57:I61)","v":0},{"$f":"SUM(Pitching!J57:J61)","v":0},{"$f":"SUM(Pitching!K57:K61)","v":0},{"$f":"SUM(Pitching!L57:L61)","v":0},{"$f":"SUM(Pitching!M57:M61)","v":0},{"$f":"SUM(Pitching!N57:N61)","v":0},{"$f":"SUM(Pitching!O57:O61)","v":0},{"$f":"SUM(Pitching!P57:P61)","v":0},{"$f":"SUM(Pitching!Q57:Q61)","v":0},{"$f":"SUM(Pitching!R57:R61)","v":1},{"$f":"SUM(Pitching!S57:S61)","v":0},{"$f":"COUNTA(Pitching!T57:T61)","v":0},{"$f":"COUNTA(Pitching!U57:U61)","v":0},{"$f":"COUNTA(Pitching!V57:V61)","v":0},null,{"$f":"IF(ISERROR(7*G4/C4),\"-\",7*G4/C4)","v":0},{"$f":"IF(ISERROR(L4/C4),0,L4/C4)","v":0},{"$f":"IF(ISERROR((M4+H4)/C4),\"-\",(M4+H4)/C4)","v":0},{"$f":"IF(ISERROR(H4/E4),\"-\",(H4/E4))","v":0}]
[{"$f":"Pitching!A17","v":32},{"$f":"IF(Pitching!B17=\"\",\"\",Pitching!B17)","v":"Biswas, T."},{"$f":"SUM(Pitching!D17:D21)","v":5},{"$f":"SUM(Pitching!E17:E21)","v":27},{"$f":"SUM(Pitching!F17:F21)","v":23},{"$f":"SUM(Pitching!G17:G21)","v":7},{"$f":"SUM(Pitching!H17:H21)","v":2},{"$f":"SUM(Pitching!I17:I21)","v":7},{"$f":"SUM(Pitching!J17:J21)","v":1},{"$f":"SUM(Pitching!K17:K21)","v":0},{"$f":"SUM(Pitching!L17:L21)","v":0},{"$f":"SUM(Pitching!M17:M21)","v":5},{"$f":"SUM(Pitching!N17:N21)","v":3},{"$f":"SUM(Pitching!O17:O21)","v":1},{"$f":"SUM(Pitching!P17:P21)","v":0},{"$f":"SUM(Pitching!Q17:Q21)","v":0},{"$f":"SUM(Pitching!R17:R21)","v":0},{"$f":"SUM(Pitching!S17:S21)","v":0},{"$f":"COUNTA(Pitching!T17:T21)","v":1},{"$f":"COUNTA(Pitching!U17:U21)","v":0},{"$f":"COUNTA(Pitching!V17:V21)","v":0},null,{"$f":"IF(ISERROR(7*G5/C5),\"-\",7*G5/C5)","v":2.8},{"$f":"IF(ISERROR(L5/C5),0,L5/C5)","v":1},{"$f":"IF(ISERROR((M5+H5)/C5),\"-\",(M5+H5)/C5)","v":2},{"$f":"IF(ISERROR(H5/E5),\"-\",(H5/E5))","v":0.30434782608695654}]
[{"$f":"Pitching!A2","v":1},{"$f":"IF(Pitching!B2=\"\",\"\",Pitching!B2)","v":"Bertonasco"},{"$f":"SUM(Pitching!D2:D6)","v":2},{"$f":"SUM(Pitching!E2:E6)","v":20},{"$f":"SUM(Pitching!F2:F6)","v":10},{"$f":"SUM(Pitching!G2:G6)","v":12},{"$f":"SUM(Pitching!H2:H6)","v":1},{"$f":"SUM(Pitching!I2:I6)","v":1},{"$f":"SUM(Pitching!J2:J6)","v":0},{"$f":"SUM(Pitching!K2:K6)","v":0},{"$f":"SUM(Pitching!L2:L6)","v":0},{"$f":"SUM(Pitching!M2:M6)","v":1},{"$f":"SUM(Pitching!N2:N6)","v":10},{"$f":"SUM(Pitching!O2:O6)","v":0},{"$f":"SUM(Pitching!P2:P6)","v":0},{"$f":"SUM(Pitching!Q2:Q6)","v":0},{"$f":"SUM(Pitching!R2:R6)","v":2},{"$f":"SUM(Pitching!S2:S6)","v":0},{"$f":"COUNTA(Pitching!T2:T6)","v":0},{"$f":"COUNTA(Pitching!U2:U6)","v":1},{"$f":"COUNTA(Pitching!V2:V6)","v":0},null,{"$f":"IF(ISERROR(7*G6/C6),\"-\",7*G6/C6)","v":3.5},{"$f":"IF(ISERROR(L6/C6),0,L6/C6)","v":0.5},{"$f":"IF(ISERROR((M6+H6)/C6),\"-\",(M6+H6)/C6)","v":5.5},{"$f":"IF(ISERROR(H6/E6),\"-\",(H6/E6))","v":0.1}]
[{"$f":"Pitching!A87","v":43},{"$f":"IF(Pitching!B87=\"\",\"\",Pitching!B87)","v":"Stepniak"},{"$f":"SUM(Pitching!D87:D91)","v":2.33},{"$f":"SUM(Pitching!E87:E91)","v":13},{"$f":"SUM(Pitching!F87:F91)","v":9},{"$f":"SUM(Pitching!G87:G91)","v":1},{"$f":"SUM(Pitching!H87:H91)","v":1},{"$f":"SUM(Pitching!I87:I91)","v":1},{"$f":"SUM(Pitching!J87:J91)","v":0},{"$f":"SUM(Pitching!K87:K91)","v":0},{"$f":"SUM(Pitching!L87:L91)","v":0},{"$f":"SUM(Pitching!M87:M91)","v":5},{"$f":"SUM(Pitching!N87:N91)","v":3},{"$f":"SUM(Pitching!O87:O91)","v":2},{"$f":"SUM(Pitching!P87:P91)","v":0},{"$f":"SUM(Pitching!Q87:Q91)","v":0},{"$f":"SUM(Pitching!R87:R91)","v":7},{"$f":"SUM(Pitching!S87:S91)","v":0},{"$f":"COUNTA(Pitching!T87:T91)","v":0},{"$f":"COUNTA(Pitching!U87:U91)","v":0},{"$f":"COUNTA(Pitching!V87:V91)","v":1},null,{"$f":"IF(ISERROR(7*G7/C7),\"-\",7*G7/C7)","v":3.0042918454935621},{"$f":"IF(ISERROR(L7/C7),0,L7/C7)","v":2.1459227467811157},{"$f":"IF(ISERROR((M7+H7)/C7),\"-\",(M7+H7)/C7)","v":1.7167381974248928},{"$f":"IF(ISERROR(H7/E7),\"-\",(H7/E7))","v":0.1111111111111111}]
[{"$f":"Pitching!A42","v":50},{"$f":"IF(Pitching!B42=\"\",\"\",Pitching!B42)","v":"Reinisch, Sophie"},{"$f":"SUM(Pitching!D42:D46)","v":17.66},{"$f":"SUM(Pitching!E42:E46)","v":80},{"$f":"SUM(Pitching!F42:F46)","v":67},{"$f":"SUM(Pitching!G42:G46)","v":17},{"$f":"SUM(Pitching!H42:H46)","v":12},{"$f":"SUM(Pitching!I42:I46)","v":17},{"$f":"SUM(Pitching!J42:J46)","v":5},{"$f":"SUM(Pitching!K42:K46)","v":1},{"$f":"SUM(Pitching!L42:L46)","v":0},{"$f":"SUM(Pitching!M42:M46)","v":10},{"$f":"SUM(Pitching!N42:N46)","v":8},{"$f":"SUM(Pitching!O42:O46)","v":0},{"$f":"SUM(Pitching!P42:P46)","v":4},{"$f":"SUM(Pitching!Q42:Q46)","v":1},{"$f":"SUM(Pitching!R42:R46)","v":3},{"$f":"SUM(Pitching!S42:S46)","v":0},{"$f":"COUNTA(Pitching!T42:T46)","v":2},{"$f":"COUNTA(Pitching!U42:U46)","v":1},{"$f":"COUNTA(Pitching!V42:V46)","v":0},null,{"$f":"IF(ISERROR(7*G8/C8),\"-\",7*G8/C8)","v":4.756511891279728},{"$f":"IF(ISERROR(L8/C8),0,L8/C8)","v":0.56625141562853909},{"$f":"IF(ISERROR((M8+H8)/C8),\"-\",(M8+H8)/C8)","v":1.4156285390713477},{"$f":"IF(ISERROR(H8/E8),\"-\",(H8/E8))","v":0.2537313432835821}]
[{"$f":"Pitching!A12","v":24},{"$f":"IF(Pitching!B12=\"\",\"\",Pitching!B12)","v":"Dickmeiss"},{"$f":"SUM(Pitching!D12:D16)","v":20},{"$f":"SUM(Pitching!E12:E16)","v":96},{"$f":"SUM(Pitching!F12:F16)","v":89},{"$f":"SUM(Pitching!G12:G16)","v":19},{"$f":"SUM(Pitching!H12:H16)","v":14},{"$f":"SUM(Pitching!I12:I16)","v":25},{"$f":"SUM(Pitching!J12:J16)","v":5},{"$f":"SUM(Pitching!K12:K16)","v":1},{"$f":"SUM(Pitching!L12:L16)","v":2},{"$f":"SUM(Pitching!M12:M16)","v":31},{"$f":"SUM(Pitching!N12:N16)","v":7},{"$f":"SUM(Pitching!O12:O16)","v":0},{"$f":"SUM(Pitching!P12:P16)","v":0},{"$f":"SUM(Pitching!Q12:Q16)","v":0},{"$f":"SUM(Pitching!R12:R16)","v":2},{"$f":"SUM(Pitching!S12:S16)","v":0},{"$f":"COUNTA(Pitching!T12:T16)","v":2},{"$f":"COUNTA(Pitching!U12:U16)","v":2},{"$f":"COUNTA(Pitching!V12:V16)","v":0},null,{"$f":"IF(ISERROR(7*G9/C9),\"-\",7*G9/C9)","v":4.9000000000000004},{"$f":"IF(ISERROR(L9/C9),0,L9/C9)","v":1.55},{"$f":"IF(ISERROR((M9+H9)/C9),\"-\",(M9+H9)/C9)","v":1.6},{"$f":"IF(ISERROR(H9/E9),\"-\",(H9/E9))","v":0.2808988764044944}]
[{"$f":"Pitching!A67","v":38},{"$f":"IF(Pitching!B67=\"\",\"\",Pitching!B67)","v":"Biswas, L."},{"$f":"SUM(Pitching!D67:D71)","v":2},{"$f":"SUM(Pitching!E67:E71)","v":13},{"$f":"SUM(Pitching!F67:F71)","v":4},{"$f":"SUM(Pitching!G67:G71)","v":2},{"$f":"SUM(Pitching!H67:H71)","v":2},{"$f":"SUM(Pitching!I67:I71)","v":0},{"$f":"SUM(Pitching!J67:J71)","v":0},{"$f":"SUM(Pitching!K67:K71)","v":0},{"$f":"SUM(Pitching!L67:L71)","v":0},{"$f":"SUM(Pitching!M67:M71)","v":1},{"$f":"SUM(Pitching!N67:N71)","v":9},{"$f":"SUM(Pitching!O67:O71)","v":0},{"$f":"SUM(Pitching!P67:P71)","v":0},{"$f":"SUM(Pitching!Q67:Q71)","v":0},{"$f":"SUM(Pitching!R67:R71)","v":7},{"$f":"SUM(Pitching!S67:S71)","v":0},{"$f":"COUNTA(Pitching!T67:T71)","v":1},{"$f":"COUNTA(Pitching!U67:U71)","v":0},{"$f":"COUNTA(Pitching!V67:V71)","v":0},null,{"$f":"IF(ISERROR(7*G10/C10),\"-\",7*G10/C10)","v":7},{"$f":"IF(ISERROR(L10/C10),0,L10/C10)","v":0.5},{"$f":"IF(ISERROR((M10+H10)/C10),\"-\",(M10+H10)/C10)","v":4.5},{"$f":"IF(ISERROR(H10/E10),\"-\",(H10/E10))","v":0}]
[{"$f":"Pitching!A72","v":41},{"$f":"IF(Pitching!B72=\"\",\"\",Pitching!B72)","v":"Thürmer"},{"$f":"SUM(Pitching!D72:D76)","v":2},{"$f":"SUM(Pitching!E72:E76)","v":10},{"$f":"SUM(Pitching!F72:F76)","v":8},{"$f":"SUM(Pitching!G72:G76)","v":2},{"$f":"SUM(Pitching!H72:H76)","v":2},{"$f":"SUM(Pitching!I72:I76)","v":2},{"$f":"SUM(Pitching!J72:J76)","v":1},{"$f":"SUM(Pitching!K72:K76)","v":0},{"$f":"SUM(Pitching!L72:L76)","v":0},{"$f":"SUM(Pitching!M72:M76)","v":1},{"$f":"SUM(Pitching!N72:N76)","v":2},{"$f":"SUM(Pitching!O72:O76)","v":0},{"$f":"SUM(Pitching!P72:P76)","v":0},{"$f":"SUM(Pitching!Q72:Q76)","v":0},{"$f":"SUM(Pitching!R72:R76)","v":0},{"$f":"SUM(Pitching!S72:S76)","v":0},{"$f":"COUNTA(Pitching!T72:T76)","v":0},{"$f":"COUNTA(Pitching!U72:U76)","v":0},{"$f":"COUNTA(Pitching!V72:V76)","v":0},null,{"$f":"IF(ISERROR(7*G11/C11),\"-\",7*G11/C11)","v":7},{"$f":"IF(ISERROR(L11/C11),0,L11/C11)","v":0.5},{"$f":"IF(ISERROR((M11+H11)/C11),\"-\",(M11+H11)/C11)","v":2},{"$f":"IF(ISERROR(H11/E11),\"-\",(H11/E11))","v":0.25}]
[{"$f":"Pitching!A62","v":51},{"$f":"IF(Pitching!B62=\"\",\"\",Pitching!B62)","v":"Raziorrouh"},{"$f":"SUM(Pitching!D62:D66)","v":8.66},{"$f":"SUM(Pitching!E62:E66)","v":53},{"$f":"SUM(Pitching!F62:F66)","v":32},{"$f":"SUM(Pitching!G62:G66)","v":17},{"$f":"SUM(Pitching!H62:H66)","v":13},{"$f":"SUM(Pitching!I62:I66)","v":11},{"$f":"SUM(Pitching!J62:J66)","v":5},{"$f":"SUM(Pitching!K62:K66)","v":0},{"$f":"SUM(Pitching!L62:L66)","v":0},{"$f":"SUM(Pitching!M62:M66)","v":1},{"$f":"SUM(Pitching!N62:N66)","v":14},{"$f":"SUM(Pitching!O62:O66)","v":1},{"$f":"SUM(Pitching!P62:P66)","v":5},{"$f":"SUM(Pitching!Q62:Q66)","v":1},{"$f":"SUM(Pitching!R62:R66)","v":1},{"$f":"SUM(Pitching!S62:S66)","v":0},{"$f":"COUNTA(Pitching!T62:T66)","v":1},{"$f":"COUNTA(Pitching!U62:U66)","v":1},{"$f":"COUNTA(Pitching!V62:V66)","v":0},null,{"$f":"IF(ISERROR(7*G12/C12),\"-\",7*G12/C12)","v":10.508083140877599},{"$f":"IF(ISERROR(L12/C12),0,L12/C12)","v":0.11547344110854503},{"$f":"IF(ISERROR((M12+H12)/C12),\"-\",(M12+H12)/C12)","v":2.8868360277136258},{"$f":"IF(ISERROR(H12/E12),\"-\",(H12/E12))","v":0.34375}]
[{"$f":"Pitching!A32","v":65},{"$f":"IF(Pitching!B32=\"\",\"\",Pitching!B32)","v":"Rauprich"},{"$f":"SUM(Pitching!D32:D36)","v":3.66},{"$f":"SUM(Pitching!E32:E36)","v":25},{"$f":"SUM(Pitching!F32:F36)","v":15},{"$f":"SUM(Pitching!G32:G36)","v":8},{"$f":"SUM(Pitching!H32:H36)","v":6},{"$f":"SUM(Pitching!I32:I36)","v":6},{"$f":"SUM(Pitching!J32:J36)","v":2},{"$f":"SUM(Pitching!K32:K36)","v":0},{"$f":"SUM(Pitching!L32:L36)","v":0},{"$f":"SUM(Pitching!M32:M36)","v":0},{"$f":"SUM(Pitching!N32:N36)","v":8},{"$f":"SUM(Pitching!O32:O36)","v":0},{"$f":"SUM(Pitching!P32:P36)","v":0},{"$f":"SUM(Pitching!Q32:Q36)","v":2},{"$f":"SUM(Pitching!R32:R36)","v":3},{"$f":"SUM(Pitching!S32:S36)","v":0},{"$f":"COUNTA(Pitching!T32:T36)","v":0},{"$f":"COUNTA(Pitching!U32:U36)","v":1},{"$f":"COUNTA(Pitching!V32:V36)","v":0},null,{"$f":"IF(ISERROR(7*G13/C13),\"-\",7*G13/C13)","v":11.475409836065573},{"$f":"IF(ISERROR(L13/C13),0,L13/C13)","v":0},{"$f":"IF(ISERROR((M13+H13)/C13),\"-\",(M13+H13)/C13)","v":3.8251366120218577},{"$f":"IF(ISERROR(H13/E13),\"-\",(H13/E13))","v":0.4}]
[{"$f":"Pitching!A92","v":0},{"$f":"IF(Pitching!B92=\"\",\"\",Pitching!B92)","v":"Rackwitz"},{"$f":"SUM(Pitching!D92:D96)","v":2},{"$f":"SUM(Pitching!E92:E96)","v":12},{"$f":"SUM(Pitching!F92:F96)","v":6},{"$f":"SUM(Pitching!G92:G96)","v":4},{"$f":"SUM(Pitching!H92:H96)","v":4},{"$f":"SUM(Pitching!I92:I96)","v":1},{"$f":"SUM(Pitching!J92:J96)","v":0},{"$f":"SUM(Pitching!K92:K96)","v":0},{"$f":"SUM(Pitching!L92:L96)","v":0},{"$f":"SUM(Pitching!M92:M96)","v":1},{"$f":"SUM(Pitching!N92:N96)","v":5},{"$f":"SUM(Pitching!O92:O96)","v":0},{"$f":"SUM(Pitching!P92:P96)","v":0},{"$f":"SUM(Pitching!Q92:Q96)","v":1},{"$f":"SUM(Pitching!R92:R96)","v":2},{"$f":"SUM(Pitching!S92:S96)","v":0},{"$f":"COUNTA(Pitching!T92:T96)","v":0},{"$f":"COUNTA(Pitching!U92:U96)","v":0},{"$f":"COUNTA(Pitching!V92:V96)","v":0},null,{"$f":"IF(ISERROR(7*G14/C14),\"-\",7*G14/C14)","v":14},{"$f":"IF(ISERROR(L14/C14),0,L14/C14)","v":0.5},{"$f":"IF(ISERROR((M14+H14)/C14),\"-\",(M14+H14)/C14)","v":3},{"$f":"IF(ISERROR(H14/E14),\"-\",(H14/E14))","v":0.16666666666666666}]
[{"$f":"Pitching!A97","v":0},{"$f":"IF(Pitching!B97=\"\",\"\",Pitching!B97)","v":"Ernst"},{"$f":"SUM(Pitching!D97:D101)","v":2},{"$f":"SUM(Pitching!E97:E101)","v":18},{"$f":"SUM(Pitching!F97:F101)","v":9},{"$f":"SUM(Pitching!G97:G101)","v":10},{"$f":"SUM(Pitching!H97:H101)","v":4},{"$f":"SUM(Pitching!I97:I101)","v":3},{"$f":"SUM(Pitching!J97:J101)","v":0},{"$f":"SUM(Pitching!K97:K101)","v":0},{"$f":"SUM(Pitching!L97:L101)","v":0},{"$f":"SUM(Pitching!M97:M101)","v":0},{"$f":"SUM(Pitching!N97:N101)","v":8},{"$f":"SUM(Pitching!O97:O101)","v":0},{"$f":"SUM(Pitching!P97:P101)","v":1},{"$f":"SUM(Pitching!Q97:Q101)","v":0},{"$f":"SUM(Pitching!R97:R101)","v":0},{"$f":"SUM(Pitching!S97:S101)","v":0},{"$f":"COUNTA(Pitching!T97:T101)","v":0},{"$f":"COUNTA(Pitching!U97:U101)","v":1},{"$f":"COUNTA(Pitching!V97:V101)","v":0},null,{"$f":"IF(ISERROR(7*G15/C15),\"-\",7*G15/C15)","v":14},{"$f":"IF(ISERROR(L15/C15),0,L15/C15)","v":0},{"$f":"IF(ISERROR((M15+H15)/C15),\"-\",(M15+H15)/C15)","v":5.5},{"$f":"IF(ISERROR(H15/E15),\"-\",(H15/E15))","v":0.33333333333333331}]
[{"$f":"Pitching!A77","v":72},{"$f":"IF(Pitching!B77=\"\",\"\",Pitching!B77)","v":"Singer"},{"$f":"SUM(Pitching!D77:D81)","v":7},{"$f":"SUM(Pitching!E77:E81)","v":56},{"$f":"SUM(Pitching!F77:F81)","v":43},{"$f":"SUM(Pitching!G77:G81)","v":27},{"$f":"SUM(Pitching!H77:H81)","v":15},{"$f":"SUM(Pitching!I77:I81)","v":15},{"$f":"SUM(Pitching!J77:J81)","v":4},{"$f":"SUM(Pitching!K77:K81)","v":3},{"$f":"SUM(Pitching!L77:L81)","v":0},{"$f":"SUM(Pitching!M77:M81)","v":8},{"$f":"SUM(Pitching!N77:N81)","v":9},{"$f":"SUM(Pitching!O77:O81)","v":4},{"$f":"SUM(Pitching!P77:P81)","v":0},{"$f":"SUM(Pitching!Q77:Q81)","v":0},{"$f":"SUM(Pitching!R77:R81)","v":3},{"$f":"SUM(Pitching!S77:S81)","v":0},{"$f":"COUNTA(Pitching!T77:T81)","v":0},{"$f":"COUNTA(Pitching!U77:U81)","v":1},{"$f":"COUNTA(Pitching!V77:V81)","v":0},null,{"$f":"IF(ISERROR(7*G16/C16),\"-\",7*G16/C16)","v":15},{"$f":"IF(ISERROR(L16/C16),0,L16/C16)","v":1.1428571428571428},{"$f":"IF(ISERROR((M16+H16)/C16),\"-\",(M16+H16)/C16)","v":3.4285714285714284},{"$f":"IF(ISERROR(H16/E16),\"-\",(H16/E16))","v":0.34883720930232559}]
[{"$f":"Pitching!A27","v":57},{"$f":"IF(Pitching!B27=\"\",\"\",Pitching!B27)","v":"Weil"},{"$f":"SUM(Pitching!D27:D31)","v":2.99},{"$f":"SUM(Pitching!E27:E31)","v":23},{"$f":"SUM(Pitching!F27:F31)","v":12},{"$f":"SUM(Pitching!G27:G31)","v":10},{"$f":"SUM(Pitching!H27:H31)","v":7},{"$f":"SUM(Pitching!I27:I31)","v":3},{"$f":"SUM(Pitching!J27:J31)","v":0},{"$f":"SUM(Pitching!K27:K31)","v":0},{"$f":"SUM(Pitching!L27:L31)","v":0},{"$f":"SUM(Pitching!M27:M31)","v":2},{"$f":"SUM(Pitching!N27:N31)","v":10},{"$f":"SUM(Pitching!O27:O31)","v":0},{"$f":"SUM(Pitching!P27:P31)","v":0},{"$f":"SUM(Pitching!Q27:Q31)","v":1},{"$f":"SUM(Pitching!R27:R31)","v":5},{"$f":"SUM(Pitching!S27:S31)","v":0},{"$f":"COUNTA(Pitching!T27:T31)","v":0},{"$f":"COUNTA(Pitching!U27:U31)","v":0},{"$f":"COUNTA(Pitching!V27:V31)","v":0},null,{"$f":"IF(ISERROR(7*G17/C17),\"-\",7*G17/C17)","v":16.387959866220733},{"$f":"IF(ISERROR(L17/C17),0,L17/C17)","v":0.66889632107023411},{"$f":"IF(ISERROR((M17+H17)/C17),\"-\",(M17+H17)/C17)","v":4.3478260869565215},{"$f":"IF(ISERROR(H17/E17),\"-\",(H17/E17))","v":0.25}]
[{"$f":"Pitching!A52","v":19},{"$f":"IF(Pitching!B52=\"\",\"\",Pitching!B52)","v":"Ottenberg"},{"$f":"SUM(Pitching!D52:D56)","v":3},{"$f":"SUM(Pitching!E52:E56)","v":25},{"$f":"SUM(Pitching!F52:F56)","v":17},{"$f":"SUM(Pitching!G52:G56)","v":12},{"$f":"SUM(Pitching!H52:H56)","v":8},{"$f":"SUM(Pitching!I52:I56)","v":4},{"$f":"SUM(Pitching!J52:J56)","v":0},{"$f":"SUM(Pitching!K52:K56)","v":1},{"$f":"SUM(Pitching!L52:L56)","v":0},{"$f":"SUM(Pitching!M52:M56)","v":2},{"$f":"SUM(Pitching!N52:N56)","v":7},{"$f":"SUM(Pitching!O52:O56)","v":1},{"$f":"SUM(Pitching!P52:P56)","v":0},{"$f":"SUM(Pitching!Q52:Q56)","v":0},{"$f":"SUM(Pitching!R52:R56)","v":2},{"$f":"SUM(Pitching!S52:S56)","v":0},{"$f":"COUNTA(Pitching!T52:T56)","v":0},{"$f":"COUNTA(Pitching!U52:U56)","v":0},{"$f":"COUNTA(Pitching!V52:V56)","v":0},null,{"$f":"IF(ISERROR(7*G18/C18),\"-\",7*G18/C18)","v":18.666666666666668},{"$f":"IF(ISERROR(L18/C18),0,L18/C18)","v":0.66666666666666663},{"$f":"IF(ISERROR((M18+H18)/C18),\"-\",(M18+H18)/C18)","v":3.6666666666666665},{"$f":"IF(ISERROR(H18/E18),\"-\",(H18/E18))","v":0.23529411764705882}]
[{"$f":"Pitching!A22","v":59},{"$f":"IF(Pitching!B22=\"\",\"\",Pitching!B22)","v":"Reibenspies"},{"$f":"SUM(Pitching!D22:D26)","v":4},{"$f":"SUM(Pitching!E22:E26)","v":41},{"$f":"SUM(Pitching!F22:F26)","v":34},{"$f":"SUM(Pitching!G22:G26)","v":12},{"$f":"SUM(Pitching!H22:H26)","v":11},{"$f":"SUM(Pitching!I22:I26)","v":12},{"$f":"SUM(Pitching!J22:J26)","v":1},{"$f":"SUM(Pitching!K22:K26)","v":2},{"$f":"SUM(Pitching!L22:L26)","v":0},{"$f":"SUM(Pitching!M22:M26)","v":5},{"$f":"SUM(Pitching!N22:N26)","v":6},{"$f":"SUM(Pitching!O22:O26)","v":0},{"$f":"SUM(Pitching!P22:P26)","v":1},{"$f":"SUM(Pitching!Q22:Q26)","v":0},{"$f":"SUM(Pitching!R22:R26)","v":3},{"$f":"SUM(Pitching!S22:S26)","v":0},{"$f":"COUNTA(Pitching!T22:T26)","v":1},{"$f":"COUNTA(Pitching!U22:U26)","v":1},{"$f":"COUNTA(Pitching!V22:V26)","v":0},null,{"$f":"IF(ISERROR(7*G19/C19),\"-\",7*G19/C19)","v":19.25},{"$f":"IF(ISERROR(L19/C19),0,L19/C19)","v":1.25},{"$f":"IF(ISERROR((M19+H19)/C19),\"-\",(M19+H19)/C19)","v":4.5},{"$f":"IF(ISERROR(H19/E19),\"-\",(H19/E19))","v":0.35294117647058826}]
[{"$f":"Pitching!A7","v":10},{"$f":"IF(Pitching!B7=\"\",\"\",Pitching!B7)","v":"Hermann"},{"$f":"SUM(Pitching!D7:D11)","v":1},{"$f":"SUM(Pitching!E7:E11)","v":8},{"$f":"SUM(Pitching!F7:F11)","v":2},{"$f":"SUM(Pitching!G7:G11)","v":3},{"$f":"SUM(Pitching!H7:H11)","v":3},{"$f":"SUM(Pitching!I7:I11)","v":0},{"$f":"SUM(Pitching!J7:J11)","v":0},{"$f":"SUM(Pitching!K7:K11)","v":0},{"$f":"SUM(Pitching!L7:L11)","v":0},{"$f":"SUM(Pitching!M7:M11)","v":0},{"$f":"SUM(Pitching!N7:N11)","v":5},{"$f":"SUM(Pitching!O7:O11)","v":1},{"$f":"SUM(Pitching!P7:P11)","v":0},{"$f":"SUM(Pitching!Q7:Q11)","v":0},{"$f":"SUM(Pitching!R7:R11)","v":0},{"$f":"SUM(Pitching!S7:S11)","v":0},{"$f":"COUNTA(Pitching!T7:T11)","v":0},{"$f":"COUNTA(Pitching!U7:U11)","v":0},{"$f":"COUNTA(Pitching!V7:V11)","v":0},null,{"$f":"IF(ISERROR(7*G20/C20),\"-\",7*G20/C20)","v":21},{"$f":"IF(ISERROR(L20/C20),0,L20/C20)","v":0},{"$f":"IF(ISERROR((M20+H20)/C20),\"-\",(M20+H20)/C20)","v":5},{"$f":"IF(ISERROR(H20/E20),\"-\",(H20/E20))","v":0}]
[{"$f":"Pitching!A37","v":70},{"$f":"IF(Pitching!B37=\"\",\"\",Pitching!B37)","v":"Parpart"},{"$f":"SUM(Pitching!D37:D41)","v":1},{"$f":"SUM(Pitching!D37:D41)","v":1},{"$f":"SUM(Pitching!E37:E41)","v":43},{"$f":"SUM(Pitching!F37:F41)","v":34},{"$f":"SUM(Pitching!G37:G41)","v":18},{"$f":"SUM(Pitching!H37:H41)","v":11},{"$f":"SUM(Pitching!I37:I41)","v":15},{"$f":"SUM(Pitching!J37:J41)","v":3},{"$f":"SUM(Pitching!K37:K41)","v":0},{"$f":"SUM(Pitching!L37:L41)","v":0},{"$f":"SUM(Pitching!M37:M41)","v":3},{"$f":"SUM(Pitching!N37:N41)","v":9},{"$f":"SUM(Pitching!O37:O41)","v":0},{"$f":"SUM(Pitching!P37:P41)","v":0},{"$f":"SUM(Pitching!Q37:Q41)","v":0},{"$f":"SUM(Pitching!R37:R41)","v":1},{"$f":"COUNTA(Pitching!T37:T41)","v":1},{"$f":"COUNTA(Pitching!U37:U41)","v":1},{"$f":"COUNTA(Pitching!V37:V41)","v":0},null,{"$f":"IF(ISERROR(7*G21/C21),\"-\",7*G21/C21)","v":126},{"$f":"IF(ISERROR(L21/C21),0,L21/C21)","v":0},{"$f":"IF(ISERROR((M21+H21)/C21),\"-\",(M21+H21)/C21)","v":14},{"$f":"IF(ISERROR(H21/E21),\"-\",(H21/E21))","v":0.2558139534883721}]
[{"$f":"Pitching!A47","v":13},{"$f":"IF(Pitching!B47=\"\",\"\",Pitching!B47)","v":"Heiland"},{"$f":"SUM(Pitching!D47:D51)","v":0.33},{"$f":"SUM(Pitching!E47:E51)","v":10},{"$f":"SUM(Pitching!F47:F51)","v":4},{"$f":"SUM(Pitching!G47:G51)","v":9},{"$f":"SUM(Pitching!H47:H51)","v":8},{"$f":"SUM(Pitching!I47:I51)","v":4},{"$f":"SUM(Pitching!J47:J51)","v":0},{"$f":"SUM(Pitching!K47:K51)","v":1},{"$f":"SUM(Pitching!L47:L51)","v":0},{"$f":"SUM(Pitching!M47:M51)","v":0},{"$f":"SUM(Pitching!N47:N51)","v":6},{"$f":"SUM(Pitching!O47:O51)","v":0},{"$f":"SUM(Pitching!P47:P51)","v":0},{"$f":"SUM(Pitching!Q47:Q51)","v":0},{"$f":"SUM(Pitching!R47:R51)","v":3},{"$f":"SUM(Pitching!S47:S51)","v":0},{"$f":"COUNTA(Pitching!T47:T51)","v":0},{"$f":"COUNTA(Pitching!U47:U51)","v":1},{"$f":"COUNTA(Pitching!V47:V51)","v":0},null,{"$f":"IF(ISERROR(7*G22/C22),\"-\",7*G22/C22)","v":169.69696969696969},{"$f":"IF(ISERROR(L22/C22),0,L22/C22)","v":0},{"$f":"IF(ISERROR((M22+H22)/C22),\"-\",(M22+H22)/C22)","v":30.303030303030301},{"$f":"IF(ISERROR(H22/E22),\"-\",(H22/E22))","v":1}]
[{"$f":"Pitching!A102","v":0},{"$f":"IF(Pitching!B102=\"\",\"\",Pitching!B102)","v":""},{"$f":"SUM(Pitching!D102:D106)","v":0},{"$f":"SUM(Pitching!E102:E106)","v":0},{"$f":"SUM(Pitching!F102:F106)","v":0},{"$f":"SUM(Pitching!G102:G106)","v":0},{"$f":"SUM(Pitching!H102:H106)","v":0},{"$f":"SUM(Pitching!I102:I106)","v":0},{"$f":"SUM(Pitching!J102:J106)","v":0},{"$f":"SUM(Pitching!K102:K106)","v":0},{"$f":"SUM(Pitching!L102:L106)","v":0},{"$f":"SUM(Pitching!M102:M106)","v":0},{"$f":"SUM(Pitching!N102:N106)","v":0},{"$f":"SUM(Pitching!O102:O106)","v":0},{"$f":"SUM(Pitching!P102:P106)","v":0},{"$f":"SUM(Pitching!Q102:Q106)","v":0},{"$f":"SUM(Pitching!R102:R106)","v":0},{"$f":"SUM(Pitching!S102:S106)","v":0},{"$f":"COUNTA(Pitching!T102:T106)","v":0},{"$f":"COUNTA(Pitching!U102:U106)","v":0},{"$f":"COUNTA(Pitching!V102:V106)","v":0},null,{"$f":"IF(ISERROR(7*G23/C23),\"-\",7*G23/C23)","v":"-"},{"$f":"IF(ISERROR(L23/C23),0,L23/C23)","v":0},{"$f":"IF(ISERROR((M23+H23)/C23),\"-\",(M23+H23)/C23)","v":"-"},{"$f":"IF(ISERROR(H23/E23),\"-\",(H23/E23))","v":"-"}]
[{"$f":"Pitching!A107","v":0},{"$f":"IF(Pitching!B107=\"\",\"\",Pitching!B107)","v":""},{"$f":"SUM(Pitching!D107:D111)","v":0},{"$f":"SUM(Pitching!E107:E111)","v":0},{"$f":"SUM(Pitching!F107:F111)","v":0},{"$f":"SUM(Pitching!G107:G111)","v":0},{"$f":"SUM(Pitching!H107:H111)","v":0},{"$f":"SUM(Pitching!I107:I111)","v":0},{"$f":"SUM(Pitching!J107:J111)","v":0},{"$f":"SUM(Pitching!K107:K111)","v":0},{"$f":"SUM(Pitching!L107:L111)","v":0},{"$f":"SUM(Pitching!M107:M111)","v":0},{"$f":"SUM(Pitching!N107:N111)","v":0},{"$f":"SUM(Pitching!O107:O111)","v":0},{"$f":"SUM(Pitching!P107:P111)","v":0},{"$f":"SUM(Pitching!Q107:Q111)","v":0},{"$f":"SUM(Pitching!R107:R111)","v":0},{"$f":"SUM(Pitching!S107:S111)","v":0},{"$f":"COUNTA(Pitching!T107:T111)","v":0},{"$f":"COUNTA(Pitching!U107:U111)","v":0},{"$f":"COUNTA(Pitching!V107:V111)","v":0},null,{"$f":"IF(ISERROR(7*G24/C24),\"-\",7*G24/C24)","v":"-"},{"$f":"IF(ISERROR(L24/C24),0,L24/C24)","v":0},{"$f":"IF(ISERROR((M24+H24)/C24),\"-\",(M24+H24)/C24)","v":"-"},{"$f":"IF(ISERROR(H24/E24),\"-\",(H24/E24))","v":"-"}]
[{"$f":"Pitching!A112","v":0},{"$f":"IF(Pitching!B112=\"\",\"\",Pitching!B112)","v":""},{"$f":"SUM(Pitching!D112:D116)","v":0},{"$f":"SUM(Pitching!E112:E116)","v":0},{"$f":"SUM(Pitching!F112:F116)","v":0},{"$f":"SUM(Pitching!G112:G116)","v":0},{"$f":"SUM(Pitching!H112:H116)","v":0},{"$f":"SUM(Pitching!I112:I116)","v":0},{"$f":"SUM(Pitching!J112:J116)","v":0},{"$f":"SUM(Pitching!K112:K116)","v":0},{"$f":"SUM(Pitching!L112:L116)","v":0},{"$f":"SUM(Pitching!M112:M116)","v":0},{"$f":"SUM(Pitching!N112:N116)","v":0},{"$f":"SUM(Pitching!O112:O116)","v":0},{"$f":"SUM(Pitching!P112:P116)","v":0},{"$f":"SUM(Pitching!Q112:Q116)","v":0},{"$f":"SUM(Pitching!R112:R116)","v":0},{"$f":"SUM(Pitching!S112:S116)","v":0},{"$f":"COUNTA(Pitching!T112:T116)","v":0},{"$f":"COUNTA(Pitching!U112:U116)","v":0},{"$f":"COUNTA(Pitching!V112:V116)","v":0},null,{"$f":"IF(ISERROR(7*G25/C25),\"-\",7*G25/C25)","v":"-"},{"$f":"IF(ISERROR(L25/C25),0,L25/C25)","v":0},{"$f":"IF(ISERROR((M25+H25)/C25),\"-\",(M25+H25)/C25)","v":"-"},{"$f":"IF(ISERROR(H25/E25),\"-\",(H25/E25))","v":"-"}]
[{"$f":"Pitching!A117","v":0},{"$f":"IF(Pitching!B117=\"\",\"\",Pitching!B117)","v":""},{"$f":"SUM(Pitching!D117:D121)","v":0},{"$f":"SUM(Pitching!E117:E121)","v":0},{"$f":"SUM(Pitching!F117:F121)","v":0},{"$f":"SUM(Pitching!G117:G121)","v":0},{"$f":"SUM(Pitching!H117:H121)","v":0},{"$f":"SUM(Pitching!I117:I121)","v":0},{"$f":"SUM(Pitching!J117:J121)","v":0},{"$f":"SUM(Pitching!K117:K121)","v":0},{"$f":"SUM(Pitching!L117:L121)","v":0},{"$f":"SUM(Pitching!M117:M121)","v":0},{"$f":"SUM(Pitching!N117:N121)","v":0},{"$f":"SUM(Pitching!O117:O121)","v":0},{"$f":"SUM(Pitching!P117:P121)","v":0},{"$f":"SUM(Pitching!Q117:Q121)","v":0},{"$f":"SUM(Pitching!R117:R121)","v":0},{"$f":"SUM(Pitching!S117:S121)","v":0},{"$f":"COUNTA(Pitching!T117:T121)","v":0},{"$f":"COUNTA(Pitching!U117:U121)","v":0},{"$f":"COUNTA(Pitching!V117:V121)","v":0},null,{"$f":"IF(ISERROR(7*G26/C26),\"-\",7*G26/C26)","v":"-"},{"$f":"IF(ISERROR(L26/C26),0,L26/C26)","v":0},{"$f":"IF(ISERROR((M26+H26)/C26),\"-\",(M26+H26)/C26)","v":"-"},{"$f":"IF(ISERROR(H26/E26),\"-\",(H26/E26))","v":"-"}]
[{"$f":"Pitching!A122","v":0},{"$f":"IF(Pitching!B122=\"\",\"\",Pitching!B122)","v":""},{"$f":"SUM(Pitching!D122:D126)","v":0},{"$f":"SUM(Pitching!E122:E126)","v":0},{"$f":"SUM(Pitching!F122:F126)","v":0},{"$f":"SUM(Pitching!G122:G126)","v":0},{"$f":"SUM(Pitching!H122:H126)","v":0},{"$f":"SUM(Pitching!I122:I126)","v":0},{"$f":"SUM(Pitching!J122:J126)","v":0},{"$f":"SUM(Pitching!K122:K126)","v":0},{"$f":"SUM(Pitching!L122:L126)","v":0},{"$f":"SUM(Pitching!M122:M126)","v":0},{"$f":"SUM(Pitching!N122:N126)","v":0},{"$f":"SUM(Pitching!O122:O126)","v":0},{"$f":"SUM(Pitching!P122:P126)","v":0},{"$f":"SUM(Pitching!Q122:Q126)","v":0},{"$f":"SUM(Pitching!R122:R126)","v":0},{"$f":"SUM(Pitching!S122:S126)","v":0},{"$f":"COUNTA(Pitching!T122:T126)","v":0},{"$f":"COUNTA(Pitching!U122:U126)","v":0},{"$f":"COUNTA(Pitching!V122:V126)","v":0},null,{"$f":"IF(ISERROR(7*G27/C27),\"-\",7*G27/C27)","v":"-"},{"$f":"IF(ISERROR(L27/C27),0,L27/C27)","v":0},{"$f":"IF(ISERROR((M27+H27)/C27),\"-\",(M27+H27)/C27)","v":"-"},{"$f":"IF(ISERROR(H27/E27),\"-\",(H27/E27))","v":"-"}]
[{"$f":"Pitching!A127","v":0},{"$f":"IF(Pitching!B127=\"\",\"\",Pitching!B127)","v":""},{"$f":"SUM(Pitching!D127:D131)","v":0},{"$f":"SUM(Pitching!E127:E131)","v":0},{"$f":"SUM(Pitching!F127:F131)","v":0},{"$f":"SUM(Pitching!G127:G131)","v":0},{"$f":"SUM(Pitching!H127:H131)","v":0},{"$f":"SUM(Pitching!I127:I131)","v":0},{"$f":"SUM(Pitching!J127:J131)","v":0},{"$f":"SUM(Pitching!K127:K131)","v":0},{"$f":"SUM(Pitching!L127:L131)","v":0},{"$f":"SUM(Pitching!M127:M131)","v":0},{"$f":"SUM(Pitching!N127:N131)","v":0},{"$f":"SUM(Pitching!O127:O131)","v":0},{"$f":"SUM(Pitching!P127:P131)","v":0},{"$f":"SUM(Pitching!Q127:Q131)","v":0},{"$f":"SUM(Pitching!R127:R131)","v":0},{"$f":"SUM(Pitching!S127:S131)","v":0},{"$f":"COUNTA(Pitching!T127:T131)","v":0},{"$f":"COUNTA(Pitching!U127:U131)","v":0},{"$f":"COUNTA(Pitching!V127:V131)","v":0},null,{"$f":"IF(ISERROR(7*G28/C28),\"-\",7*G28/C28)","v":"-"},{"$f":"IF(ISERROR(L28/C28),0,L28/C28)","v":0},{"$f":"IF(ISERROR((M28+H28)/C28),\"-\",(M28+H28)/C28)","v":"-"},{"$f":"IF(ISERROR(H28/E28),\"-\",(H28/E28))","v":"-"}]
[{"$f":"Pitching!A132","v":0},{"$f":"IF(Pitching!B132=\"\",\"\",Pitching!B132)","v":""},{"$f":"SUM(Pitching!D132:D136)","v":0},{"$f":"SUM(Pitching!E132:E136)","v":0},{"$f":"SUM(Pitching!F132:F136)","v":0},{"$f":"SUM(Pitching!G132:G136)","v":0},{"$f":"SUM(Pitching!H132:H136)","v":0},{"$f":"SUM(Pitching!I132:I136)","v":0},{"$f":"SUM(Pitching!J132:J136)","v":0},{"$f":"SUM(Pitching!K132:K136)","v":0},{"$f":"SUM(Pitching!L132:L136)","v":0},{"$f":"SUM(Pitching!M132:M136)","v":0},{"$f":"SUM(Pitching!N132:N136)","v":0},{"$f":"SUM(Pitching!O132:O136)","v":0},{"$f":"SUM(Pitching!P132:P136)","v":0},{"$f":"SUM(Pitching!Q132:Q136)","v":0},{"$f":"SUM(Pitching!R132:R136)","v":0},{"$f":"SUM(Pitching!S132:S136)","v":0},{"$f":"COUNTA(Pitching!T132:T136)","v":0},{"$f":"COUNTA(Pitching!U132:U136)","v":0},{"$f":"COUNTA(Pitching!V132:V136)","v":0},null,{"$f":"IF(ISERROR(7*G29/C29),\"-\",7*G29/C29)","v":"-"},{"$f":"IF(ISERROR(L29/C29),0,L29/C29)","v":0},{"$f":"IF(ISERROR((M29+H29)/C29),\"-\",(M29+H29)/C29)","v":"-"},{"$f":"IF(ISERROR(H29/E29),\"-\",(H29/E29))","v":"-"}]
[{"$f":"Pitching!A137","v":0},{"$f":"IF(Pitching!B137=\"\",\"\",Pitching!B137)","v":""},{"$f":"SUM(Pitching!D137:D141)","v":0},{"$f":"SUM(Pitching!E137:E141)","v":0},{"$f":"SUM(Pitching!F137:F141)","v":0},{"$f":"SUM(Pitching!G137:G141)","v":0},{"$f":"SUM(Pitching!H137:H141)","v":0},{"$f":"SUM(Pitching!I137:I141)","v":0},{"$f":"SUM(Pitching!J137:J141)","v":0},{"$f":"SUM(Pitching!K137:K141)","v":0},{"$f":"SUM(Pitching!L137:L141)","v":0},{"$f":"SUM(Pitching!M137:M141)","v":0},{"$f":"SUM(Pitching!N137:N141)","v":0},{"$f":"SUM(Pitching!O137:O141)","v":0},{"$f":"SUM(Pitching!P137:P141)","v":0},{"$f":"SUM(Pitching!Q137:Q141)","v":0},{"$f":"SUM(Pitching!R137:R141)","v":0},{"$f":"SUM(Pitching!S137:S141)","v":0},{"$f":"COUNTA(Pitching!T137:T141)","v":0},{"$f":"COUNTA(Pitching!U137:U141)","v":0},{"$f":"COUNTA(Pitching!V137:V141)","v":0},null,{"$f":"IF(ISERROR(7*G30/C30),\"-\",7*G30/C30)","v":"-"},{"$f":"IF(ISERROR(L30/C30),0,L30/C30)","v":0},{"$f":"IF(ISERROR((M30+H30)/C30),\"-\",(M30+H30)/C30)","v":"-"},{"$f":"IF(ISERROR(H30/E30),\"-\",(H30/E30))","v":"-"}]
[{"$f":"Pitching!A142","v":0},{"$f":"IF(Pitching!B142=\"\",\"\",Pitching!B142)","v":""},{"$f":"SUM(Pitching!D142:D146)","v":0},{"$f":"SUM(Pitching!E142:E146)","v":0},{"$f":"SUM(Pitching!F142:F146)","v":0},{"$f":"SUM(Pitching!G142:G146)","v":0},{"$f":"SUM(Pitching!H142:H146)","v":0},{"$f":"SUM(Pitching!I142:I146)","v":0},{"$f":"SUM(Pitching!J142:J146)","v":0},{"$f":"SUM(Pitching!K142:K146)","v":0},{"$f":"SUM(Pitching!L142:L146)","v":0},{"$f":"SUM(Pitching!M142:M146)","v":0},{"$f":"SUM(Pitching!N142:N146)","v":0},{"$f":"SUM(Pitching!O142:O146)","v":0},{"$f":"SUM(Pitching!P142:P146)","v":0},{"$f":"SUM(Pitching!Q142:Q146)","v":0},{"$f":"SUM(Pitching!R142:R146)","v":0},{"$f":"SUM(Pitching!S142:S146)","v":0},{"$f":"COUNTA(Pitching!T142:T146)","v":0},{"$f":"COUNTA(Pitching!U142:U146)","v":0},{"$f":"COUNTA(Pitching!V142:V146)","v":0},null,{"$f":"IF(ISERROR(7*G31/C31),\"-\",7*G31/C31)","v":"-"},{"$f":"IF(ISERROR(L31/C31),0,L31/C31)","v":0},{"$f":"IF(ISERROR((M31+H31)/C31),\"-\",(M31+H31)/C31)","v":"-"},{"$f":"IF(ISERROR(H31/E31),\"-\",(H31/E31))","v":"-"}]
[{"$f":"Pitching!A147","v":0},{"$f":"IF(Pitching!B147=\"\",\"\",Pitching!B147)","v":""},{"$f":"SUM(Pitching!D147:D151)","v":0},{"$f":"SUM(Pitching!E147:E151)","v":0},{"$f":"SUM(Pitching!F147:F151)","v":0},{"$f":"SUM(Pitching!G147:G151)","v":0},{"$f":"SUM(Pitching!H147:H151)","v":0},{"$f":"SUM(Pitching!I147:I151)","v":0},{"$f":"SUM(Pitching!J147:J151)","v":0},{"$f":"SUM(Pitching!K147:K151)","v":0},{"$f":"SUM(Pitching!L147:L151)","v":0},{"$f":"SUM(Pitching!M147:M151)","v":0},{"$f":"SUM(Pitching!N147:N151)","v":0},{"$f":"SUM(Pitching!O147:O151)","v":0},{"$f":"SUM(Pitching!P147:P151)","v":0},{"$f":"SUM(Pitching!Q147:Q151)","v":0},{"$f":"SUM(Pitching!R147:R151)","v":0},{"$f":"SUM(Pitching!S147:S151)","v":0},{"$f":"COUNTA(Pitching!T147:T151)","v":0},{"$f":"COUNTA(Pitching!U147:U151)","v":0},{"$f":"COUNTA(Pitching!V147:V151)","v":0},null,{"$f":"IF(ISERROR(7*G32/C32),\"-\",7*G32/C32)","v":"-"},{"$f":"IF(ISERROR(L32/C32),0,L32/C32)","v":0},{"$f":"IF(ISERROR((M32+H32)/C32),\"-\",(M32+H32)/C32)","v":"-"},{"$f":"IF(ISERROR(H32/E32),\"-\",(H32/E32))","v":"-"}]
[{"$f":"Pitching!A152","v":0},{"$f":"IF(Pitching!B152=\"\",\"\",Pitching!B152)","v":""},{"$f":"SUM(Pitching!D152:D156)","v":0},{"$f":"SUM(Pitching!E152:E156)","v":0},{"$f":"SUM(Pitching!F152:F156)","v":0},{"$f":"SUM(Pitching!G152:G156)","v":0},{"$f":"SUM(Pitching!H152:H156)","v":0},{"$f":"SUM(Pitching!I152:I156)","v":0},{"$f":"SUM(Pitching!J152:J156)","v":0},{"$f":"SUM(Pitching!K152:K156)","v":0},{"$f":"SUM(Pitching!L152:L156)","v":0},{"$f":"SUM(Pitching!M152:M156)","v":0},{"$f":"SUM(Pitching!N152:N156)","v":0},{"$f":"SUM(Pitching!O152:O156)","v":0},{"$f":"SUM(Pitching!P152:P156)","v":0},{"$f":"SUM(Pitching!Q152:Q156)","v":0},{"$f":"SUM(Pitching!R152:R156)","v":0},{"$f":"SUM(Pitching!S152:S156)","v":0},{"$f":"COUNTA(Pitching!T152:T156)","v":0},{"$f":"COUNTA(Pitching!U152:U156)","v":0},{"$f":"COUNTA(Pitching!V152:V156)","v":0},null,{"$f":"IF(ISERROR(7*G33/C33),\"-\",7*G33/C33)","v":"-"},{"$f":"IF(ISERROR(L33/C33),0,L33/C33)","v":0},{"$f":"IF(ISERROR((M33+H33)/C33),\"-\",(M33+H33)/C33)","v":"-"},{"$f":"IF(ISERROR(H33/E33),\"-\",(H33/E33))","v":"-"}]
[{"$f":"Pitching!A157","v":0},{"$f":"IF(Pitching!B157=\"\",\"\",Pitching!B157)","v":""},{"$f":"SUM(Pitching!D157:D161)","v":0},{"$f":"SUM(Pitching!E157:E161)","v":0},{"$f":"SUM(Pitching!F157:F161)","v":0},{"$f":"SUM(Pitching!G157:G161)","v":0},{"$f":"SUM(Pitching!H157:H161)","v":0},{"$f":"SUM(Pitching!I157:I161)","v":0},{"$f":"SUM(Pitching!J157:J161)","v":0},{"$f":"SUM(Pitching!K157:K161)","v":0},{"$f":"SUM(Pitching!L157:L161)","v":0},{"$f":"SUM(Pitching!M157:M161)","v":0},{"$f":"SUM(Pitching!N157:N161)","v":0},{"$f":"SUM(Pitching!O157:O161)","v":0},{"$f":"SUM(Pitching!P157:P161)","v":0},{"$f":"SUM(Pitching!Q157:Q161)","v":0},{"$f":"SUM(Pitching!R157:R161)","v":0},{"$f":"SUM(Pitching!S157:S161)","v":0},{"$f":"COUNTA(Pitching!T157:T161)","v":0},{"$f":"COUNTA(Pitching!U157:U161)","v":0},{"$f":"COUNTA(Pitching!V157:V161)","v":0},null,{"$f":"IF(ISERROR(7*G34/C34),\"-\",7*G34/C34)","v":"-"},{"$f":"IF(ISERROR(L34/C34),0,L34/C34)","v":0},{"$f":"IF(ISERROR((M34+H34)/C34),\"-\",(M34+H34)/C34)","v":"-"},{"$f":"IF(ISERROR(H34/E34),\"-\",(H34/E34))","v":"-"}]
[{"$f":"Pitching!A162","v":0},{"$f":"IF(Pitching!B162=\"\",\"\",Pitching!B162)","v":""},{"$f":"SUM(Pitching!D162:D166)","v":0},{"$f":"SUM(Pitching!E162:E166)","v":0},{"$f":"SUM(Pitching!F162:F166)","v":0},{"$f":"SUM(Pitching!G162:G166)","v":0},{"$f":"SUM(Pitching!H162:H166)","v":0},{"$f":"SUM(Pitching!I162:I166)","v":0},{"$f":"SUM(Pitching!J162:J166)","v":0},{"$f":"SUM(Pitching!K162:K166)","v":0},{"$f":"SUM(Pitching!L162:L166)","v":0},{"$f":"SUM(Pitching!M162:M166)","v":0},{"$f":"SUM(Pitching!N162:N166)","v":0},{"$f":"SUM(Pitching!O162:O166)","v":0},{"$f":"SUM(Pitching!P162:P166)","v":0},{"$f":"SUM(Pitching!Q162:Q166)","v":0},{"$f":"SUM(Pitching!R162:R166)","v":0},{"$f":"SUM(Pitching!S162:S166)","v":0},{"$f":"COUNTA(Pitching!T162:T166)","v":0},{"$f":"COUNTA(Pitching!U162:U166)","v":0},{"$f":"COUNTA(Pitching!V162:V166)","v":0},null,{"$f":"IF(ISERROR(7*G35/C35),\"-\",7*G35/C35)","v":"-"},{"$f":"IF(ISERROR(L35/C35),0,L35/C35)","v":0},{"$f":"IF(ISERROR((M35+H35)/C35),\"-\",(M35+H35)/C35)","v":"-"},{"$f":"IF(ISERROR(H35/E35),\"-\",(H35/E35))","v":"-"}]
[{"$f":"Pitching!A167","v":0},{"$f":"IF(Pitching!B167=\"\",\"\",Pitching!B167)","v":""},{"$f":"SUM(Pitching!D167:D171)","v":0},{"$f":"SUM(Pitching!E167:E171)","v":0},{"$f":"SUM(Pitching!F167:F171)","v":0},{"$f":"SUM(Pitching!G167:G171)","v":0},{"$f":"SUM(Pitching!H167:H171)","v":0},{"$f":"SUM(Pitching!I167:I171)","v":0},{"$f":"SUM(Pitching!J167:J171)","v":0},{"$f":"SUM(Pitching!K167:K171)","v":0},{"$f":"SUM(Pitching!L167:L171)","v":0},{"$f":"SUM(Pitching!M167:M171)","v":0},{"$f":"SUM(Pitching!N167:N171)","v":0},{"$f":"SUM(Pitching!O167:O171)","v":0},{"$f":"SUM(Pitching!P167:P171)","v":0},{"$f":"SUM(Pitching!Q167:Q171)","v":0},{"$f":"SUM(Pitching!R167:R171)","v":0},{"$f":"SUM(Pitching!S167:S171)","v":0},{"$f":"COUNTA(Pitching!T167:T171)","v":0},{"$f":"COUNTA(Pitching!U167:U171)","v":0},{"$f":"COUNTA(Pitching!V167:V171)","v":0},null,{"$f":"IF(ISERROR(7*G36/C36),\"-\",7*G36/C36)","v":"-"},{"$f":"IF(ISERROR(L36/C36),0,L36/C36)","v":0},{"$f":"IF(ISERROR((M36+H36)/C36),\"-\",(M36+H36)/C36)","v":"-"},{"$f":"IF(ISERROR(H36/E36),\"-\",(H36/E36))","v":"-"}]
[{"$f":"Pitching!A172","v":0},{"$f":"IF(Pitching!B172=\"\",\"\",Pitching!B172)","v":""},{"$f":"SUM(Pitching!D172:D176)","v":0},{"$f":"SUM(Pitching!E172:E176)","v":0},{"$f":"SUM(Pitching!F172:F176)","v":0},{"$f":"SUM(Pitching!G172:G176)","v":0},{"$f":"SUM(Pitching!H172:H176)","v":0},{"$f":"SUM(Pitching!I172:I176)","v":0},{"$f":"SUM(Pitching!J172:J176)","v":0},{"$f":"SUM(Pitching!K172:K176)","v":0},{"$f":"SUM(Pitching!L172:L176)","v":0},{"$f":"SUM(Pitching!M172:M176)","v":0},{"$f":"SUM(Pitching!N172:N176)","v":0},{"$f":"SUM(Pitching!O172:O176)","v":0},{"$f":"SUM(Pitching!P172:P176)","v":0},{"$f":"SUM(Pitching!Q172:Q176)","v":0},{"$f":"SUM(Pitching!R172:R176)","v":0},{"$f":"SUM(Pitching!S172:S176)","v":0},{"$f":"COUNTA(Pitching!T172:T176)","v":0},{"$f":"COUNTA(Pitching!U172:U176)","v":0},{"$f":"COUNTA(Pitching!V172:V176)","v":0},null,{"$f":"IF(ISERROR(7*G37/C37),\"-\",7*G37/C37)","v":"-"},{"$f":"IF(ISERROR(L37/C37),0,L37/C37)","v":0},{"$f":"IF(ISERROR((M37+H37)/C37),\"-\",(M37+H37)/C37)","v":"-"},{"$f":"IF(ISERROR(H37/E37),\"-\",(H37/E37))","v":"-"}]
[{"$f":"Pitching!A177","v":0},{"$f":"IF(Pitching!B177=\"\",\"\",Pitching!B177)","v":""},{"$f":"SUM(Pitching!D177:D181)","v":0},{"$f":"SUM(Pitching!E177:E181)","v":0},{"$f":"SUM(Pitching!F177:F181)","v":0},{"$f":"SUM(Pitching!G177:G181)","v":0},{"$f":"SUM(Pitching!H177:H181)","v":0},{"$f":"SUM(Pitching!I177:I181)","v":0},{"$f":"SUM(Pitching!J177:J181)","v":0},{"$f":"SUM(Pitching!K177:K181)","v":0},{"$f":"SUM(Pitching!L177:L181)","v":0},{"$f":"SUM(Pitching!M177:M181)","v":0},{"$f":"SUM(Pitching!N177:N181)","v":0},{"$f":"SUM(Pitching!O177:O181)","v":0},{"$f":"SUM(Pitching!P177:P181)","v":0},{"$f":"SUM(Pitching!Q177:Q181)","v":0},{"$f":"SUM(Pitching!R177:R181)","v":0},{"$f":"SUM(Pitching!S177:S181)","v":0},{"$f":"COUNTA(Pitching!T177:T181)","v":0},{"$f":"COUNTA(Pitching!U177:U181)","v":0},{"$f":"COUNTA(Pitching!V177:V181)","v":0},null,{"$f":"IF(ISERROR(7*G38/C38),\"-\",7*G38/C38)","v":"-"},{"$f":"IF(ISERROR(L38/C38),0,L38/C38)","v":0},{"$f":"IF(ISERROR((M38+H38)/C38),\"-\",(M38+H38)/C38)","v":"-"},{"$f":"IF(ISERROR(H38/E38),\"-\",(H38/E38))","v":"-"}]
[{"$f":"Pitching!A182","v":0},{"$f":"IF(Pitching!B182=\"\",\"\",Pitching!B182)","v":""},{"$f":"SUM(Pitching!D182:D186)","v":0},{"$f":"SUM(Pitching!E182:E186)","v":0},{"$f":"SUM(Pitching!F182:F186)","v":0},{"$f":"SUM(Pitching!G182:G186)","v":0},{"$f":"SUM(Pitching!H182:H186)","v":0},{"$f":"SUM(Pitching!I182:I186)","v":0},{"$f":"SUM(Pitching!J182:J186)","v":0},{"$f":"SUM(Pitching!K182:K186)","v":0},{"$f":"SUM(Pitching!L182:L186)","v":0},{"$f":"SUM(Pitching!M182:M186)","v":0},{"$f":"SUM(Pitching!N182:N186)","v":0},{"$f":"SUM(Pitching!O182:O186)","v":0},{"$f":"SUM(Pitching!P182:P186)","v":0},{"$f":"SUM(Pitching!Q182:Q186)","v":0},{"$f":"SUM(Pitching!R182:R186)","v":0},{"$f":"SUM(Pitching!S182:S186)","v":0},{"$f":"COUNTA(Pitching!T182:T186)","v":0},{"$f":"COUNTA(Pitching!U182:U186)","v":0},{"$f":"COUNTA(Pitching!V182:V186)","v":0},null,{"$f":"IF(ISERROR(7*G39/C39),\"-\",7*G39/C39)","v":"-"},{"$f":"IF(ISERROR(L39/C39),0,L39/C39)","v":0},{"$f":"IF(ISERROR((M39+H39)/C39),\"-\",(M39+H39)/C39)","v":"-"},{"$f":"IF(ISERROR(H39/E39),\"-\",(H39/E39))","v":"-"}]
[{"$f":"Pitching!A187","v":0},{"$f":"IF(Pitching!B187=\"\",\"\",Pitching!B187)","v":""},{"$f":"SUM(Pitching!D187:D191)","v":0},{"$f":"SUM(Pitching!E187:E191)","v":0},{"$f":"SUM(Pitching!F187:F191)","v":0},{"$f":"SUM(Pitching!G187:G191)","v":0},{"$f":"SUM(Pitching!H187:H191)","v":0},{"$f":"SUM(Pitching!I187:I191)","v":0},{"$f":"SUM(Pitching!J187:J191)","v":0},{"$f":"SUM(Pitching!K187:K191)","v":0},{"$f":"SUM(Pitching!L187:L191)","v":0},{"$f":"SUM(Pitching!M187:M191)","v":0},{"$f":"SUM(Pitching!N187:N191)","v":0},{"$f":"SUM(Pitching!O187:O191)","v":0},{"$f":"SUM(Pitching!P187:P191)","v":0},{"$f":"SUM(Pitching!Q187:Q191)","v":0},{"$f":"SUM(Pitching!R187:R191)","v":0},{"$f":"SUM(Pitching!S187:S191)","v":0},{"$f":"COUNTA(Pitching!T187:T191)","v":0},{"$f":"COUNTA(Pitching!U187:U191)","v":0},{"$f":"COUNTA(Pitching!V187:V191)","v":0},null,{"$f":"IF(ISERROR(7*G40/C40),\"-\",7*G40/C40)","v":"-"},{"$f":"IF(ISERROR(L40/C40),0,L40/C40)","v":0},{"$f":"IF(ISERROR((M40+H40)/C40),\"-\",(M40+H40)/C40)","v":"-"},{"$f":"IF(ISERROR(H40/E40),\"-\",(H40/E40))","v":"-"}]
[{"$f":"Pitching!A192","v":0},{"$f":"IF(Pitching!B192=\"\",\"\",Pitching!B192)","v":""},{"$f":"SUM(Pitching!D192:D196)","v":0},{"$f":"SUM(Pitching!E192:E196)","v":0},{"$f":"SUM(Pitching!F192:F196)","v":0},{"$f":"SUM(Pitching!G192:G196)","v":0},{"$f":"SUM(Pitching!H192:H196)","v":0},{"$f":"SUM(Pitching!I192:I196)","v":0},{"$f":"SUM(Pitching!J192:J196)","v":0},{"$f":"SUM(Pitching!K192:K196)","v":0},{"$f":"SUM(Pitching!L192:L196)","v":0},{"$f":"SUM(Pitching!M192:M196)","v":0},{"$f":"SUM(Pitching!N192:N196)","v":0},{"$f":"SUM(Pitching!O192:O196)","v":0},{"$f":"SUM(Pitching!P192:P196)","v":0},{"$f":"SUM(Pitching!Q192:Q196)","v":0},{"$f":"SUM(Pitching!R192:R196)","v":0},{"$f":"SUM(Pitching!S192:S196)","v":0},{"$f":"COUNTA(Pitching!T192:T196)","v":0},{"$f":"COUNTA(Pitching!U192:U196)","v":0},{"$f":"COUNTA(Pitching!V192:V196)","v":0},null,{"$f":"IF(ISERROR(7*G41/C41),\"-\",7*G41/C41)","v":"-"},{"$f":"IF(ISERROR(L41/C41),0,L41/C41)","v":0},{"$f":"IF(ISERROR((M41+H41)/C41),\"-\",(M41+H41)/C41)","v":"-"},{"$f":"IF(ISERROR(H41/E41),\"-\",(H41/E41))","v":"-"}]
[{"$f":"Pitching!A197","v":0},{"$f":"IF(Pitching!B197=\"\",\"\",Pitching!B197)","v":""},{"$f":"SUM(Pitching!D197:D201)","v":0},{"$f":"SUM(Pitching!E197:E201)","v":0},{"$f":"SUM(Pitching!F197:F201)","v":0},{"$f":"SUM(Pitching!G197:G201)","v":0},{"$f":"SUM(Pitching!H197:H201)","v":0},{"$f":"SUM(Pitching!I197:I201)","v":0},{"$f":"SUM(Pitching!J197:J201)","v":0},{"$f":"SUM(Pitching!K197:K201)","v":0},{"$f":"SUM(Pitching!L197:L201)","v":0},{"$f":"SUM(Pitching!M197:M201)","v":0},{"$f":"SUM(Pitching!N197:N201)","v":0},{"$f":"SUM(Pitching!O197:O201)","v":0},{"$f":"SUM(Pitching!P197:P201)","v":0},{"$f":"SUM(Pitching!Q197:Q201)","v":0},{"$f":"SUM(Pitching!R197:R201)","v":0},{"$f":"SUM(Pitching!S197:S201)","v":0},{"$f":"COUNTA(Pitching!T197:T201)","v":0},{"$f":"COUNTA(Pitching!U197:U201)","v":0},{"$f":"COUNTA(Pitching!V197:V201)","v":0},null,{"$f":"IF(ISERROR(7*G42/C42),\"-\",7*G42/C42)","v":"-"},{"$f":"IF(ISERROR(L42/C42),0,L42/C42)","v":0},{"$f":"IF(ISERROR((M42+H42)/C42),\"-\",(M42+H42)/C42)","v":"-"},{"$f":"IF(ISERROR(H42/E42),\"-\",(H42/E42))","v":"-"}]
[{"$f":"Pitching!A202","v":0},{"$f":"IF(Pitching!B202=\"\",\"\",Pitching!B202)","v":""},{"$f":"SUM(Pitching!D202:D206)","v":0},{"$f":"SUM(Pitching!E202:E206)","v":0},{"$f":"SUM(Pitching!F202:F206)","v":0},{"$f":"SUM(Pitching!G202:G206)","v":0},{"$f":"SUM(Pitching!H202:H206)","v":0},{"$f":"SUM(Pitching!I202:I206)","v":0},{"$f":"SUM(Pitching!J202:J206)","v":0},{"$f":"SUM(Pitching!K202:K206)","v":0},{"$f":"SUM(Pitching!L202:L206)","v":0},{"$f":"SUM(Pitching!M202:M206)","v":0},{"$f":"SUM(Pitching!N202:N206)","v":0},{"$f":"SUM(Pitching!O202:O206)","v":0},{"$f":"SUM(Pitching!P202:P206)","v":0},{"$f":"SUM(Pitching!Q202:Q206)","v":0},{"$f":"SUM(Pitching!R202:R206)","v":0},{"$f":"SUM(Pitching!S202:S206)","v":0},{"$f":"COUNTA(Pitching!T202:T206)","v":0},{"$f":"COUNTA(Pitching!U202:U206)","v":0},{"$f":"COUNTA(Pitching!V202:V206)","v":0},null,{"$f":"IF(ISERROR(7*G43/C43),\"-\",7*G43/C43)","v":"-"},{"$f":"IF(ISERROR(L43/C43),0,L43/C43)","v":0},{"$f":"IF(ISERROR((M43+H43)/C43),\"-\",(M43+H43)/C43)","v":"-"},{"$f":"IF(ISERROR(H43/E43),\"-\",(H43/E43))","v":"-"}]
[{"$f":"Pitching!A207","v":0},{"$f":"IF(Pitching!B207=\"\",\"\",Pitching!B207)","v":""},{"$f":"SUM(Pitching!D207:D211)","v":0},{"$f":"SUM(Pitching!E207:E211)","v":0},{"$f":"SUM(Pitching!F207:F211)","v":0},{"$f":"SUM(Pitching!G207:G211)","v":0},{"$f":"SUM(Pitching!H207:H211)","v":0},{"$f":"SUM(Pitching!I207:I211)","v":0},{"$f":"SUM(Pitching!J207:J211)","v":0},{"$f":"SUM(Pitching!K207:K211)","v":0},{"$f":"SUM(Pitching!L207:L211)","v":0},{"$f":"SUM(Pitching!M207:M211)","v":0},{"$f":"SUM(Pitching!N207:N211)","v":0},{"$f":"SUM(Pitching!O207:O211)","v":0},{"$f":"SUM(Pitching!P207:P211)","v":0},{"$f":"SUM(Pitching!Q207:Q211)","v":0},{"$f":"SUM(Pitching!R207:R211)","v":0},{"$f":"SUM(Pitching!S207:S211)","v":0},{"$f":"COUNTA(Pitching!T207:T211)","v":0},{"$f":"COUNTA(Pitching!U207:U211)","v":0},{"$f":"COUNTA(Pitching!V207:V211)","v":0},null,{"$f":"IF(ISERROR(7*G44/C44),\"-\",7*G44/C44)","v":"-"},{"$f":"IF(ISERROR(L44/C44),0,L44/C44)","v":0},{"$f":"IF(ISERROR((M44+H44)/C44),\"-\",(M44+H44)/C44)","v":"-"},{"$f":"IF(ISERROR(H44/E44),\"-\",(H44/E44))","v":"-"}]
[{"$f":"Pitching!A212","v":0},{"$f":"IF(Pitching!B212=\"\",\"\",Pitching!B212)","v":""},{"$f":"SUM(Pitching!D212:D216)","v":0},{"$f":"SUM(Pitching!E212:E216)","v":0},{"$f":"SUM(Pitching!F212:F216)","v":0},{"$f":"SUM(Pitching!G212:G216)","v":0},{"$f":"SUM(Pitching!H212:H216)","v":0},{"$f":"SUM(Pitching!I212:I216)","v":0},{"$f":"SUM(Pitching!J212:J216)","v":0},{"$f":"SUM(Pitching!K212:K216)","v":0},{"$f":"SUM(Pitching!L212:L216)","v":0},{"$f":"SUM(Pitching!M212:M216)","v":0},{"$f":"SUM(Pitching!N212:N216)","v":0},{"$f":"SUM(Pitching!O212:O216)","v":0},{"$f":"SUM(Pitching!P212:P216)","v":0},{"$f":"SUM(Pitching!Q212:Q216)","v":0},{"$f":"SUM(Pitching!R212:R216)","v":0},{"$f":"SUM(Pitching!S212:S216)","v":0},{"$f":"COUNTA(Pitching!T212:T216)","v":0},{"$f":"COUNTA(Pitching!U212:U216)","v":0},{"$f":"COUNTA(Pitching!V212:V216)","v":0},null,{"$f":"IF(ISERROR(7*G45/C45),\"-\",7*G45/C45)","v":"-"},{"$f":"IF(ISERROR(L45/C45),0,L45/C45)","v":0},{"$f":"IF(ISERROR((M45+H45)/C45),\"-\",(M45+H45)/C45)","v":"-"},{"$f":"IF(ISERROR(H45/E45),\"-\",(H45/E45))","v":"-"}]
[{"$f":"Pitching!A217","v":0},{"$f":"IF(Pitching!B217=\"\",\"\",Pitching!B217)","v":""},{"$f":"SUM(Pitching!D217:D221)","v":0},{"$f":"SUM(Pitching!E217:E221)","v":0},{"$f":"SUM(Pitching!F217:F221)","v":0},{"$f":"SUM(Pitching!G217:G221)","v":0},{"$f":"SUM(Pitching!H217:H221)","v":0},{"$f":"SUM(Pitching!I217:I221)","v":0},{"$f":"SUM(Pitching!J217:J221)","v":0},{"$f":"SUM(Pitching!K217:K221)","v":0},{"$f":"SUM(Pitching!L217:L221)","v":0},{"$f":"SUM(Pitching!M217:M221)","v":0},{"$f":"SUM(Pitching!N217:N221)","v":0},{"$f":"SUM(Pitching!O217:O221)","v":0},{"$f":"SUM(Pitching!P217:P221)","v":0},{"$f":"SUM(Pitching!Q217:Q221)","v":0},{"$f":"SUM(Pitching!R217:R221)","v":0},{"$f":"SUM(Pitching!S217:S221)","v":0},{"$f":"COUNTA(Pitching!T217:T221)","v":0},{"$f":"COUNTA(Pitching!U217:U221)","v":0},{"$f":"COUNTA(Pitching!V217:V221)","v":0},null,{"$f":"IF(ISERROR(7*G46/C46),\"-\",7*G46/C46)","v":"-"},{"$f":"IF(ISERROR(L46/C46),0,L46/C46)","v":0},{"$f":"IF(ISERROR((M46+H46)/C46),\"-\",(M46+H46)/C46)","v":"-"},{"$f":"IF(ISERROR(H46/E46),\"-\",(H46/E46))","v":"-"}]
[{"$f":"Pitching!A222","v":0},{"$f":"IF(Pitching!B222=\"\",\"\",Pitching!B222)","v":""},{"$f":"SUM(Pitching!D222:D226)","v":0},{"$f":"SUM(Pitching!E222:E226)","v":0},{"$f":"SUM(Pitching!F222:F226)","v":0},{"$f":"SUM(Pitching!G222:G226)","v":0},{"$f":"SUM(Pitching!H222:H226)","v":0},{"$f":"SUM(Pitching!I222:I226)","v":0},{"$f":"SUM(Pitching!J222:J226)","v":0},{"$f":"SUM(Pitching!K222:K226)","v":0},{"$f":"SUM(Pitching!L222:L226)","v":0},{"$f":"SUM(Pitching!M222:M226)","v":0},{"$f":"SUM(Pitching!N222:N226)","v":0},{"$f":"SUM(Pitching!O222:O226)","v":0},{"$f":"SUM(Pitching!P222:P226)","v":0},{"$f":"SUM(Pitching!Q222:Q226)","v":0},{"$f":"SUM(Pitching!R222:R226)","v":0},{"$f":"SUM(Pitching!S222:S226)","v":0},{"$f":"COUNTA(Pitching!T222:T226)","v":0},{"$f":"COUNTA(Pitching!U222:U226)","v":0},{"$f":"COUNTA(Pitching!V222:V226)","v":0},null,{"$f":"IF(ISERROR(7*G47/C47),\"-\",7*G47/C47)","v":"-"},{"$f":"IF(ISERROR(L47/C47),0,L47/C47)","v":0},{"$f":"IF(ISERROR((M47+H47)/C47),\"-\",(M47+H47)/C47)","v":"-"},{"$f":"IF(ISERROR(H47/E47),\"-\",(H47/E47))","v":"-"}]
[{"$f":"Pitching!A227","v":0},{"$f":"IF(Pitching!B227=\"\",\"\",Pitching!B227)","v":""},{"$f":"SUM(Pitching!D227:D231)","v":0},{"$f":"SUM(Pitching!E227:E231)","v":0},{"$f":"SUM(Pitching!F227:F231)","v":0},{"$f":"SUM(Pitching!G227:G231)","v":0},{"$f":"SUM(Pitching!H227:H231)","v":0},{"$f":"SUM(Pitching!I227:I231)","v":0},{"$f":"SUM(Pitching!J227:J231)","v":0},{"$f":"SUM(Pitching!K227:K231)","v":0},{"$f":"SUM(Pitching!L227:L231)","v":0},{"$f":"SUM(Pitching!M227:M231)","v":0},{"$f":"SUM(Pitching!N227:N231)","v":0},{"$f":"SUM(Pitching!O227:O231)","v":0},{"$f":"SUM(Pitching!P227:P231)","v":0},{"$f":"SUM(Pitching!Q227:Q231)","v":0},{"$f":"SUM(Pitching!R227:R231)","v":0},{"$f":"SUM(Pitching!S227:S231)","v":0},{"$f":"COUNTA(Pitching!T227:T231)","v":0},{"$f":"COUNTA(Pitching!U227:U231)","v":0},{"$f":"COUNTA(Pitching!V227:V231)","v":0},null,{"$f":"IF(ISERROR(7*G48/C48),\"-\",7*G48/C48)","v":"-"},{"$f":"IF(ISERROR(L48/C48),0,L48/C48)","v":0},{"$f":"IF(ISERROR((M48+H48)/C48),\"-\",(M48+H48)/C48)","v":"-"},{"$f":"IF(ISERROR(H48/E48),\"-\",(H48/E48))","v":"-"}]
[{"$f":"Pitching!A232","v":0},{"$f":"IF(Pitching!B232=\"\",\"\",Pitching!B232)","v":""},{"$f":"SUM(Pitching!D232:D236)","v":0},{"$f":"SUM(Pitching!E232:E236)","v":0},{"$f":"SUM(Pitching!F232:F236)","v":0},{"$f":"SUM(Pitching!G232:G236)","v":0},{"$f":"SUM(Pitching!H232:H236)","v":0},{"$f":"SUM(Pitching!I232:I236)","v":0},{"$f":"SUM(Pitching!J232:J236)","v":0},{"$f":"SUM(Pitching!K232:K236)","v":0},{"$f":"SUM(Pitching!L232:L236)","v":0},{"$f":"SUM(Pitching!M232:M236)","v":0},{"$f":"SUM(Pitching!N232:N236)","v":0},{"$f":"SUM(Pitching!O232:O236)","v":0},{"$f":"SUM(Pitching!P232:P236)","v":0},{"$f":"SUM(Pitching!Q232:Q236)","v":0},{"$f":"SUM(Pitching!R232:R236)","v":0},{"$f":"SUM(Pitching!S232:S236)","v":0},{"$f":"COUNTA(Pitching!T232:T236)","v":0},{"$f":"COUNTA(Pitching!U232:U236)","v":0},{"$f":"COUNTA(Pitching!V232:V236)","v":0},null,{"$f":"IF(ISERROR(7*G49/C49),\"-\",7*G49/C49)","v":"-"},{"$f":"IF(ISERROR(L49/C49),0,L49/C49)","v":0},{"$f":"IF(ISERROR((M49+H49)/C49),\"-\",(M49+H49)/C49)","v":"-"},{"$f":"IF(ISERROR(H49/E49),\"-\",(H49/E49))","v":"-"}]
[{"$f":"Pitching!A237","v":0},{"$f":"IF(Pitching!B237=\"\",\"\",Pitching!B237)","v":""},{"$f":"SUM(Pitching!D237:D241)","v":0},{"$f":"SUM(Pitching!E237:E241)","v":0},{"$f":"SUM(Pitching!F237:F241)","v":0},{"$f":"SUM(Pitching!G237:G241)","v":0},{"$f":"SUM(Pitching!H237:H241)","v":0},{"$f":"SUM(Pitching!I237:I241)","v":0},{"$f":"SUM(Pitching!J237:J241)","v":0},{"$f":"SUM(Pitching!K237:K241)","v":0},{"$f":"SUM(Pitching!L237:L241)","v":0},{"$f":"SUM(Pitching!M237:M241)","v":0},{"$f":"SUM(Pitching!N237:N241)","v":0},{"$f":"SUM(Pitching!O237:O241)","v":0},{"$f":"SUM(Pitching!P237:P241)","v":0},{"$f":"SUM(Pitching!Q237:Q241)","v":0},{"$f":"SUM(Pitching!R237:R241)","v":0},{"$f":"SUM(Pitching!S237:S241)","v":0},{"$f":"COUNTA(Pitching!T237:T241)","v":0},{"$f":"COUNTA(Pitching!U237:U241)","v":0},{"$f":"COUNTA(Pitching!V237:V241)","v":0},null,{"$f":"IF(ISERROR(7*G50/C50),\"-\",7*G50/C50)","v":"-"},{"$f":"IF(ISERROR(L50/C50),0,L50/C50)","v":0},{"$f":"IF(ISERROR((M50+H50)/C50),\"-\",(M50+H50)/C50)","v":"-"},{"$f":"IF(ISERROR(H50/E50),\"-\",(H50/E50))","v":"-"}]
[{"$f":"Pitching!A242","v":0},{"$f":"IF(Pitching!B242=\"\",\"\",Pitching!B242)","v":""},{"$f":"SUM(Pitching!D242:D246)","v":0},{"$f":"SUM(Pitching!E242:E246)","v":0},{"$f":"SUM(Pitching!F242:F246)","v":0},{"$f":"SUM(Pitching!G242:G246)","v":0},{"$f":"SUM(Pitching!H242:H246)","v":0},{"$f":"SUM(Pitching!I242:I246)","v":0},{"$f":"SUM(Pitching!J242:J246)","v":0},{"$f":"SUM(Pitching!K242:K246)","v":0},{"$f":"SUM(Pitching!L242:L246)","v":0},{"$f":"SUM(Pitching!M242:M246)","v":0},{"$f":"SUM(Pitching!N242:N246)","v":0},{"$f":"SUM(Pitching!O242:O246)","v":0},{"$f":"SUM(Pitching!P242:P246)","v":0},{"$f":"SUM(Pitching!Q242:Q246)","v":0},{"$f":"SUM(Pitching!R242:R246)","v":0},{"$f":"SUM(Pitching!S242:S246)","v":0},{"$f":"COUNTA(Pitching!T242:T246)","v":0},{"$f":"COUNTA(Pitching!U242:U246)","v":0},{"$f":"COUNTA(Pitching!V242:V246)","v":0},null,{"$f":"IF(ISERROR(7*G51/C51),\"-\",7*G51/C51)","v":"-"},{"$f":"IF(ISERROR(L51/C51),0,L51/C51)","v":0},{"$f":"IF(ISERROR((M51+H51)/C51),\"-\",(M51+H51)/C51)","v":"-"},{"$f":"IF(ISERROR(H51/E51),\"-\",(H51/E51))","v":"-"}]
[{"$f":"Pitching!A247","v":0},{"$f":"IF(Pitching!B247=\"\",\"\",Pitching!B247)","v":""},{"$f":"SUM(Pitching!D247:D251)","v":0},{"$f":"SUM(Pitching!E247:E251)","v":0},{"$f":"SUM(Pitching!F247:F251)","v":0},{"$f":"SUM(Pitching!G247:G251)","v":0},{"$f":"SUM(Pitching!H247:H251)","v":0},{"$f":"SUM(Pitching!I247:I251)","v":0},{"$f":"SUM(Pitching!J247:J251)","v":0},{"$f":"SUM(Pitching!K247:K251)","v":0},{"$f":"SUM(Pitching!L247:L251)","v":0},{"$f":"SUM(Pitching!M247:M251)","v":0},{"$f":"SUM(Pitching!N247:N251)","v":0},{"$f":"SUM(Pitching!O247:O251)","v":0},{"$f":"SUM(Pitching!P247:P251)","v":0},{"$f":"SUM(Pitching!Q247:Q251)","v":0},{"$f":"SUM(Pitching!R247:R251)","v":0},{"$f":"SUM(Pitching!S247:S251)","v":0},{"$f":"COUNTA(Pitching!T247:T251)","v":0},{"$f":"COUNTA(Pitching!U247:U251)","v":0},{"$f":"COUNTA(Pitching!V247:V251)","v":0},null,{"$f":"IF(ISERROR(7*G52/C52),\"-\",7*G52/C52)","v":"-"},{"$f":"IF(ISERROR(L52/C52),0,L52/C52)","v":0},{"$f":"IF(ISERROR((M52+H52)/C52),\"-\",(M52+H52)/C52)","v":"-"},{"$f":"IF(ISERROR(H52/E52),\"-\",(H52/E52))","v":"-"}]